program: Gaussian 09
title: 000212592
version: EM64L-G09RevD.01
frameworkgroup: C1[X(C12H23NO2)]
method: RPBEPBE
basis: SDD
operation: Freq
keyword: #p
keyword: freq=noraman
keyword: PBEPBE/SDD
title: #p freq=noraman PBEPBE/SDD
converged: YES YES NO NO
title: Mulliken charges:
elementType: O O N C C C C C C C C C C C C H H H H H H H H H H H H H H H H H H H H H H H
charge: -0.274493 -0.233513 -0.084156 -0.365725 -0.370780 -0.391118 -0.386206 -0.399081 -0.341270 -0.315704 0.154199 0.228067 -0.698818 -0.691860 -0.697294 0.177153 0.219103 0.211139 0.169201 0.193698 0.204307 0.203270 0.192036 0.214100 0.189374 0.221171 0.213459 0.235852 0.233029 0.238516 0.212242 0.215421 0.224387 0.203552 0.227400 0.217795 0.212444 0.239102
chargesum: 0.00000
title: Mulliken charges with hydrogens summed into heavy atoms:
elementType: O O N C C C C C C C C C C C C
charge: -0.274493 -0.233513 -0.084156 0.030530 0.009560 0.006888 0.009100 0.004393 0.093360 0.153177 0.154199 0.228067 -0.032638 -0.036521 -0.027953
polarizability: 1.76223417e+02 5.21305006e-01 1.32116212e+02 -1.62809060e+00 -1.28027914e+00 1.18297929e+02
1716.lowfreq: -18.7827 -1.3083 -0.0006 -0.0005 0.0007 7.3398 20.4714 24.8592 34.0822
frequency: 16.7221 24.3019 34.0303 52.8451 78.1167 103.7710 169.1095 182.0538 201.6667 228.3836 238.2021 251.8446 255.5727 282.6708 305.9960 323.6683 345.6372 354.9068 371.0053 373.2728 395.0928 447.6864 450.7658 501.7196 557.4328 587.1645 718.4330 733.6134 757.8236 797.3085 807.1542 837.6117 850.6578 855.1101 903.4679 928.6656 933.7680 940.8581 954.7054 955.5280 993.3195 1025.5811 1026.7003 1043.7780 1051.1230 1066.0342 1097.5521 1101.3949 1116.0196 1129.3869 1149.3641 1159.4614 1197.2360 1206.7227 1230.3230 1255.9611 1261.5724 1265.5320 1266.7847 1292.6018 1296.8359 1319.0775 1331.2188 1339.2448 1346.5411 1354.1157 1372.1735 1372.8855 1379.5352 1392.1347 1404.1275 1449.8115 1450.1051 1453.0031 1459.1009 1461.5734 1465.7461 1466.3885 1469.9578 1474.3857 1474.8241 1478.1363 1480.7291 1499.1103 1622.9347 2825.0170 2836.4850 2898.8258 2967.1044 2982.0547 2983.4712 2984.4133 2986.8912 2990.3891 3022.6250 3033.3657 3036.0417 3040.3986 3043.5658 3046.0380 3055.3116 3074.3321 3077.5967 3088.7692 3095.1153 3099.9098 3103.3367 3126.0511
redmass: 2.7395 3.9197 3.6365 5.8557 3.9984 3.0757 2.9212 1.1893 1.8736 2.0545 1.8359 1.1346 1.2255 2.5967 2.3888 2.5069 3.3107 2.6303 2.6845 2.4501 2.2883 2.8421 2.9178 3.0043 2.5076 2.6676 7.0905 3.0639 3.7192 1.5055 1.4303 2.6212 1.5473 2.4338 2.4008 3.7165 1.7426 1.7234 1.2038 1.3147 2.5140 1.4776 1.4409 2.1496 1.9005 2.8903 3.4811 1.8585 2.2704 1.7967 1.3300 2.4103 1.3701 2.8770 3.0138 1.4029 1.4531 1.7596 1.5503 1.2822 1.2653 1.3198 1.3066 1.4278 1.4678 1.3903 1.2367 1.3054 1.2006 1.3972 1.2120 1.0919 1.0916 1.0492 1.0878 1.0872 1.0503 1.0895 1.0476 1.0536 1.0837 1.0547 1.0939 1.0682 9.7150 1.0715 1.0703 1.0691 1.0627 1.0348 1.0353 1.0614 1.0611 1.0358 1.0882 1.0946 1.0774 1.0862 1.0747 1.1026 1.1036 1.1005 1.0997 1.0998 1.1002 1.0998 1.0993 1.1076
irintensity: 0.3524 0.3193 0.2268 1.7735 0.0151 0.4251 0.6935 0.2352 1.1585 0.3731 0.8489 0.1921 0.3864 2.3778 5.7497 8.4941 7.8673 1.5033 7.5657 2.1680 8.5063 1.7892 1.4837 2.2313 0.9979 0.4309 4.5574 7.2256 3.8451 0.5121 0.3974 14.5530 2.8536 11.5729 2.9436 28.9767 3.4536 4.5931 0.1407 3.5756 20.5539 26.6242 9.8810 4.1824 18.9050 45.6211 291.5443 103.9479 7.2950 0.2406 4.8663 25.1042 3.0179 6.1970 14.1616 2.1939 1.9489 3.3537 26.6985 3.4786 7.7037 5.9423 1.4755 0.5807 3.6399 2.8623 16.9138 6.7167 18.4679 1.0271 20.0613 7.7903 10.4756 0.0133 12.9244 5.5761 0.1989 9.6937 0.2493 10.1234 6.3264 16.0666 13.4358 36.7562 150.4987 54.6945 125.1432 79.7613 38.4865 35.1135 17.3092 34.0988 33.6043 30.5121 45.9552 77.7708 24.0694 1.9299 54.9621 12.4250 99.5811 14.3722 28.5226 52.4492 16.6243 17.4430 45.4474 14.5801
temp: 298.150 k
press: 1.00000 atm
elementType: 8 8 7 6 6 6 6 6 6 6 6 6 6 6 6 1 1 1 1 1 1 1 1 1 1 1 1 1 1 1 1 1 1 1 1 1 1 1
symmnumber: 1
zpe: 879587.8 jmol-1
zpe.correction: 0.335017 hartree
zpe.thermalcorrener: 0.352201 hartree
zpe.thermalcorrenthalpy: 0.353146 hartree
zpe.thermalcorrgfe: 0.288287 hartree
zpe.sumelectzpe: -675.043694 hartree
zpe.sumelectthermal: -675.026510 hartree
zpe.sumelectthermalent: -675.025566 hartree
zpe.sumelectthermalfe: -675.090425 hartree
dipole: -0.3660 -1.5595 -0.3221
dipole: 1.6339
quadrupole: -84.0556 -96.4667 -93.0184
quadrupole: -2.6683 1.2769 2.0390
quadrupole: 7.1246 -5.2864 -1.8382 -2.6683 1.2769 2.0390
hfenergy: -675.3787113 hartree
pointgroup: C01 [X(C12H23N1O2)]
dipole: -0.168594 0.5964472 0.1704954 debye
polarizability: 176.2219271|1.3086325|132.2565603|0.9521009|-0.264558|118.1590707 unknown
InChI: InChI=1S/C12H23NO2/c1-12(2,3)11(14)15-10-9-13-7-5-4-6-8-13/h4-10H2,1-3H3
charge 0 multiplicity 1
38 atoms
O  1.481548 0.767679 -0.69256
O  1.811203 -1.398787 0.093704
N  -2.226152 0.324632 -0.055027
C  -2.489806 -1.125163 0.146801
C  -3.219669 1.162984 0.663877
C  -3.896663 -1.505361 -0.356283
C  -4.651788 0.854542 0.180006
C  -4.975435 -0.648221 0.345038
C  -0.822435 0.694163 0.237114
C  0.060497 0.429941 -0.9973
C  3.692087 0.242052 0.158752
C  2.260836 -0.249106 -0.125179
C  3.626637 1.459082 1.127036
C  4.499718 -0.910879 0.799793
C  4.348166 0.678925 -1.184212
H  -2.402098 -1.394237 1.233068
H  -1.720694 -1.708147 -0.390811
H  -2.977946 2.226311 0.478386
H  -3.166607 0.995822 1.772924
H  -4.073353 -2.582658 -0.172739
H  -3.94213 -1.338238 -1.449832
H  -4.732319 1.134612 -0.888304
H  -5.372729 1.475235 0.746373
H  -5.978546 -0.875341 -0.062878
H  -4.999883 -0.902131 1.425309
H  -0.407387 0.137684 1.110968
H  -0.775971 1.77175 0.479379
H  -0.21498 1.0960 -1.828416
H  0.003586 -0.625795 -1.31316
H  3.047895 2.286392 0.683467
H  4.651902 1.815434 1.337332
H  3.158151 1.179837 2.088753
H  4.044157 -1.236528 1.751081
H  5.532724 -0.57307 1.001128
H  4.53915 -1.789221 0.132748
H  4.402215 -0.165987 -1.894914
H  5.378503 1.030381 -0.991521
H  3.777418 1.496216 -1.656001
