program: Gaussian 09
title: 000212506
version: EM64L-G09RevD.01
frameworkgroup: C1[X(C25H23N3O2)]
method: RPBEPBE
basis: SDD
operation: Freq
keyword: #p
keyword: freq=noraman
keyword: PBEPBE/SDD
title: #p freq=noraman PBEPBE/SDD
converged: YES YES NO NO
title: Mulliken charges:
elementType: O O N N N C C C C C C C C C C C C C C C C C C C C C C C C C H H H H H H H H H H H H H H H H H H H H H H H
charge: -0.297738 -0.252877 -0.124886 -0.275258 -0.415730 0.277457 0.005253 0.140378 0.437651 -0.649219 -0.780949 -0.441611 0.080090 -0.362434 -0.391726 0.310683 -0.216876 -0.212471 0.358849 -0.345072 -0.370807 -0.254069 -0.411990 -0.397310 0.338510 -0.390496 -0.389436 -0.236205 -0.236961 -0.237769 0.329801 0.242508 0.235801 0.266193 0.241297 0.242230 0.241651 0.284044 0.239179 0.288721 0.265886 0.226307 0.225673 0.256608 0.274372 0.243236 0.242297 0.228123 0.239844 0.239712 0.228565 0.228598 0.232371
chargesum: 0.00000
title: Mulliken charges with hydrogens summed into heavy atoms:
elementType: O O N N N C C C C C C C C C C C C C C C C C C C C C C C C C
charge: -0.297738 -0.252877 -0.124886 -0.275258 -0.085929 0.277457 0.005253 0.140378 0.437651 0.095283 -0.055771 0.081612 0.080090 -0.073712 -0.125840 0.310683 0.009431 0.013202 0.358849 -0.088464 -0.096435 -0.025945 -0.168755 -0.155013 0.338510 -0.150652 -0.149723 -0.007640 -0.008364 -0.005398
polarizability: 5.64095986e+02 2.98543668e+01 3.35625768e+02 -2.65694665e+01 5.23957389e+00 1.61735482e+02
1716.lowfreq: -2.9822 -2.5275 -0.0013 -0.0003 0.0005 2.0632 13.0807 16.0728 21.3952
frequency: 12.9773 16.0395 21.3820 36.8437 54.6152 57.7697 63.0636 78.1226 81.3034 102.9719 112.6804 129.2592 139.8123 147.0503 149.6634 164.2905 176.3583 208.9174 233.4755 252.7174 264.2903 270.8150 287.4563 297.4577 329.2940 358.1987 381.8329 403.0089 406.2062 408.8864 411.8459 431.3818 438.1189 459.5655 479.3967 497.3994 507.1501 532.7833 558.4149 563.6941 578.8786 613.1690 613.5015 619.7359 629.1476 634.2779 655.8874 664.5836 697.7683 700.5802 709.6799 735.6366 736.4037 761.4006 772.2004 794.0565 840.1223 843.3102 849.9483 859.1390 860.0199 899.4029 914.5551 922.8413 955.4796 971.3904 975.0850 977.5108 984.9860 986.6130 989.2206 992.0844 995.9006 996.4094 999.1035 1013.1821 1019.8271 1029.7335 1035.7091 1040.0167 1042.2208 1079.1762 1086.6565 1093.6875 1125.6050 1130.5131 1137.7411 1171.0563 1174.8912 1175.2974 1179.3290 1187.6229 1191.6957 1197.2460 1209.5436 1244.4620 1291.1758 1304.7174 1306.9213 1312.2946 1317.8253 1320.8772 1336.1120 1360.3042 1377.2682 1384.3830 1390.7337 1416.9676 1422.7766 1428.6126 1437.0857 1439.3508 1445.2605 1460.9620 1466.9257 1470.8687 1476.5359 1480.4176 1485.3053 1489.4828 1516.3690 1545.8984 1578.5781 1586.1919 1589.1898 1598.0012 1611.2706 1614.0643 1618.9036 1666.3645 2919.6988 2961.3097 2963.6900 2997.9625 3042.4848 3076.5995 3078.4217 3118.8663 3125.2736 3127.2753 3129.4408 3136.0574 3137.7052 3138.2416 3142.8457 3151.2439 3154.3266 3156.6796 3162.4837 3165.8467 3166.9794 3191.9658 3504.0688
redmass: 4.1818 5.0139 6.1192 5.5700 5.0142 4.9037 4.6093 4.4253 4.1924 4.2869 3.2911 3.5413 1.5995 2.6995 3.0981 3.9564 4.6481 1.2826 2.7464 5.4539 2.8645 4.3561 5.5833 5.3443 4.8412 6.7467 3.9380 2.8490 3.1629 2.9752 4.3025 4.6738 5.8648 2.5381 2.1819 2.7569 3.3794 2.6602 5.0843 5.5339 2.2808 6.5016 6.3160 7.2050 5.9457 6.8851 5.4420 4.4994 2.1084 1.7425 9.9091 4.8026 3.3085 1.6805 1.9028 5.7934 1.4321 1.2498 1.2614 2.6076 1.6852 3.3333 1.5119 1.4468 1.8597 1.3628 1.4629 1.5802 3.7307 4.9334 1.5124 3.9332 3.3902 1.6136 1.4585 3.3252 2.5030 1.9341 1.5793 1.9298 1.9934 1.8059 1.6240 2.0284 1.4027 1.9752 3.0030 1.0598 1.0566 4.1794 1.8226 1.3591 1.1238 1.1301 1.2108 2.0032 2.8063 2.5731 1.4406 2.3144 1.5636 1.5744 3.3377 2.8135 9.4670 8.0687 1.4036 2.2224 2.0773 1.3420 2.6335 2.2954 2.3653 1.0693 1.2120 1.2053 1.1122 1.6453 2.2893 1.1241 2.6720 6.1351 6.4431 6.6094 6.7661 8.4270 5.9984 6.7133 6.2912 9.1248 1.0699 1.0428 1.0399 1.0865 1.0943 1.0949 1.0935 1.1018 1.0846 1.0850 1.0875 1.0875 1.0882 1.0895 1.0916 1.0964 1.0940 1.0958 1.0968 1.0994 1.1016 1.0956 1.0757
irintensity: 0.6295 2.3641 1.1061 0.4098 2.0079 2.4755 2.3467 0.6572 0.1920 7.3070 3.8934 3.2133 1.8164 5.4587 1.0619 4.1725 0.1505 0.3649 0.8581 11.4258 3.2476 2.6225 3.8953 3.7817 9.1519 12.7104 10.4776 0.6283 0.3039 0.9061 2.7875 10.9193 2.6477 42.6230 32.3469 4.2850 14.0910 25.6790 8.0553 25.4776 30.2005 0.2940 2.0513 28.2729 10.9706 0.5754 55.9134 21.1308 47.8600 46.9631 2.9933 8.1140 14.2023 67.9135 67.3098 6.5734 22.3866 0.9851 0.5680 2.1221 21.3949 10.1083 11.9534 2.2878 2.6909 0.7473 0.0390 1.7030 0.6133 20.1482 0.5741 62.9309 1.7446 0.1111 0.8761 15.5411 15.6936 3.4951 1.9982 0.2666 2.1569 24.3598 8.4774 10.8652 10.7943 90.0311 12.2345 0.5128 0.3745 28.1250 24.9808 26.0885 20.0442 98.9272 5.5798 47.1963 0.5711 43.9269 41.2354 306.3442 75.9981 224.6795 85.7298 49.6321 3.3652 2.5257 8.6639 26.8448 6.2070 43.2821 52.5512 12.0502 42.3825 36.9168 12.9496 9.0441 23.2550 75.6544 144.8158 8.6076 0.1257 52.8310 56.2388 52.3921 14.1341 269.1219 0.4404 109.5524 47.8919 286.2893 94.4669 60.1441 78.9259 70.1542 17.3430 4.2767 31.7970 13.7004 8.0589 2.1159 0.6871 12.8782 10.5042 15.9928 7.0661 30.3797 27.3911 17.3672 1.7491 21.4595 34.3772 2.1715 113.7887
temp: 298.150 k
press: 1.00000 atm
elementType: 8 8 7 7 7 6 6 6 6 6 6 6 6 6 6 6 6 6 6 6 6 6 6 6 6 6 6 6 6 6 1 1 1 1 1 1 1 1 1 1 1 1 1 1 1 1 1 1 1 1 1 1 1
symmnumber: 1
zpe: 1101277.5 jmol-1
zpe.correction: 0.419454 hartree
zpe.thermalcorrener: 0.446409 hartree
zpe.thermalcorrenthalpy: 0.447353 hartree
zpe.thermalcorrgfe: 0.358847 hartree
zpe.sumelectzpe: -1279.045381 hartree
zpe.sumelectthermal: -1279.018426 hartree
zpe.sumelectthermalent: -1279.017482 hartree
zpe.sumelectthermalfe: -1279.105988 hartree
dipole: -0.3213 -0.6290 0.7148
dipole: 1.0049
quadrupole: -122.4779 -165.4870 -178.3264
quadrupole: 16.3061 -3.2980 2.2643
quadrupole: 32.9525 -10.0566 -22.8960 16.3061 -3.2980 2.2643
hfenergy: -1279.4648353 hartree
pointgroup: C01 [X(C25H23N3O2)]
dipole: -0.1233539 0.2524875 -0.2780973 debye
polarizability: 563.4293295|-31.5638308|335.7623665|28.546125|7.5912769|162.265541 unknown
InChI: InChI=1S/C25H23N3O2/c1-18-24(25(30)28(27(18)2)22-11-7-4-8-12-22)26-17-23(29)21-15-13-20(14-16-21)19-9-5-3-6-10-19/h3-16,26H,17H2,1-2H3
charge 0 multiplicity 1
53 atoms
O  -2.343965 -0.945536 0.709575
O  0.930023 3.162653 0.262438
N  -5.000391 1.283761 -0.175947
N  -4.496402 0.003822 0.234111
N  -1.398303 1.908699 0.116035
C  -3.860572 2.145791 -0.229562
C  -2.704369 1.443102 0.087918
C  -3.077235 0.05095 0.404983
C  -5.300542 -1.164044 0.090381
C  -6.179527 1.745481 0.612126
C  -4.012663 3.591556 -0.597703
C  -0.229854 1.049658 0.018208
C  1.03417 1.900103 0.147551
C  -5.003691 -2.317116 0.863942
C  -6.384947 -1.181462 -0.826697
C  2.361025 1.221342 0.118322
C  -5.797558 -3.473428 0.715082
C  -7.178333 -2.341454 -0.950503
C  4.955554 0.002932 0.06115
C  2.497006 -0.191486 0.026132
C  3.539046 2.014775 0.183302
C  -6.891866 -3.493162 -0.181433
C  3.771069 -0.785565 -0.001023
C  4.809451 1.417527 0.154325
C  6.302953 -0.631451 0.032094
C  7.399645 -0.050303 0.728528
C  6.530226 -1.835198 -0.692428
C  8.675951 -0.650424 0.702264
C  7.806428 -2.43553 -0.720287
C  8.88673 -1.846476 -0.022752
H  -1.18758 2.909676 0.159352
H  -6.504345 2.715204 0.203023
H  -5.934401 1.861454 1.687474
H  -7.004745 1.024827 0.503564
H  -3.052586 3.980915 -0.981521
H  -4.3080 4.231015 0.257964
H  -4.76716 3.723915 -1.394317
H  -0.249577 0.256151 0.791329
H  -0.183609 0.510059 -0.955312
H  -4.151587 -2.300663 1.546447
H  -6.571785 -0.304821 -1.455094
H  -5.560988 -4.362593 1.310069
H  -8.01236 -2.348561 -1.661338
H  1.611218 -0.8346 -0.009428
H  3.425877 3.102156 0.24587
H  3.851381 -1.877235 -0.036681
H  5.702305 2.051902 0.172469
H  -7.50717 -4.393492 -0.283866
H  7.244843 0.858105 1.321387
H  5.711483 -2.286434 -1.264169
H  9.503309 -0.190997 1.254435
H  7.960504 -3.356854 -1.292868
H  9.877916 -2.312546 -0.043723
