program: Gaussian 09
title: 000212500
version: EM64L-G09RevD.01
frameworkgroup: C1[X(C15H18I3NO4)]
method: RPBEPBE
basis: SDD
operation: Freq
keyword: #p
keyword: freq=noraman
keyword: PBEPBE/SDD
title: #p freq=noraman PBEPBE/SDD
converged: YES YES NO NO
title: Mulliken charges:
elementType: I I I O O O O N C C C C C C C C C C C C C C C H H H H H H H H H H H H H H H H H H
charge: 0.159920 0.146407 0.150908 -0.284234 -0.415728 -0.203492 -0.262570 -0.247313 -0.372019 -0.083921 -0.352164 0.673738 0.661664 -0.638819 -0.344562 -0.690557 0.165371 -0.543395 -0.554275 -0.107479 0.193389 -0.662970 -0.762713 0.220879 0.228000 0.238817 0.239396 0.203149 0.222164 0.258783 0.208121 0.221494 0.213009 0.277249 0.222534 0.256528 0.216487 0.249082 0.250561 0.262070 0.386493
chargesum: 0.00000
title: Mulliken charges with hydrogens summed into heavy atoms:
elementType: I I I O O O O N C C C C C C C C C C C C C C C
charge: 0.159920 0.146407 0.150908 -0.284234 -0.029235 -0.203492 -0.262570 -0.247313 0.076860 0.154896 0.090381 0.673738 0.661664 -0.638819 0.136385 -0.047932 0.165371 -0.543395 -0.554275 0.169771 0.193389 0.032578 -0.001001
polarizability: 3.46764429e+02 5.73680015e+00 2.84599758e+02 8.05450809e+00 -3.22572439e+00 1.67213629e+02
1716.lowfreq: -9.1161 -0.8609 -0.0003 0.0000 0.0005 5.9759 19.3905 19.6544 31.1393
frequency: 17.7967 19.5220 30.6177 37.2439 44.5684 58.0191 60.2237 66.3635 68.1353 74.6955 82.6973 85.2822 91.6049 98.2520 107.3763 129.1406 146.7236 154.3974 161.8549 183.9492 185.7721 216.7255 218.2527 240.7799 246.8288 272.4068 289.8568 309.5961 322.0235 359.9960 380.7381 417.9272 441.5288 468.9004 479.1650 484.1654 517.9202 555.4144 570.8608 585.2179 601.4652 621.7319 634.3496 678.0339 692.3984 717.3529 741.1329 749.0211 765.4990 802.0978 820.3272 868.2490 876.4122 899.2328 913.8161 940.0026 992.7329 1007.5093 1017.2722 1025.9817 1034.0142 1036.7873 1066.4146 1085.7548 1101.6597 1120.6759 1142.3973 1151.3618 1199.8386 1239.3474 1241.2100 1251.0900 1261.6853 1276.7928 1292.8702 1297.9940 1307.5839 1318.6140 1331.1601 1362.4084 1365.9557 1370.5692 1381.0047 1387.1500 1390.0888 1403.9088 1444.7497 1448.4216 1448.6359 1465.4662 1468.0574 1475.5740 1476.8020 1479.7836 1486.4122 1507.4974 1528.1945 1605.1301 1672.9684 2973.7276 2979.2755 2983.3933 2989.1425 2996.2374 3004.8440 3012.7812 3041.8533 3061.1074 3072.2526 3077.0301 3080.3135 3084.9101 3085.9692 3111.3902 3128.0888 3184.6612 3513.4234
redmass: 4.1422 6.1555 4.7108 3.3901 8.9832 5.1320 4.9869 2.0427 2.8957 3.0276 2.4462 6.7114 5.1580 12.6298 6.8249 3.4764 4.2559 5.3900 62.2286 6.6370 3.9060 1.9876 1.6354 2.2421 1.9101 3.2562 3.2834 5.2374 3.5938 4.1515 5.0061 4.9380 6.7638 4.8652 4.2607 3.7590 3.8924 4.3553 4.9112 3.4319 3.4646 2.0880 3.8143 8.3772 5.8694 4.4313 1.2490 8.2705 1.3216 3.2076 2.6636 1.9934 1.3926 1.9772 2.5637 2.8347 1.8098 4.9714 3.7790 2.4439 1.6658 2.6422 2.1876 2.5708 2.7120 2.5534 1.7875 1.9670 2.1185 1.3376 2.6864 1.5398 1.6547 2.3468 3.4000 1.3006 1.8487 2.1372 1.5922 1.4331 1.9616 1.5351 1.2606 1.2214 1.2164 3.3508 1.1345 1.0830 1.0592 1.0601 1.0472 1.0504 1.0419 1.0511 1.0830 10.7517 8.6981 7.2176 9.5455 1.0359 1.0784 1.0660 1.0364 1.0376 1.0621 1.0595 1.0955 1.1016 1.1029 1.0996 1.1013 1.0983 1.0970 1.1023 1.0997 1.0930 1.0643
irintensity: 0.1652 0.0178 0.1683 0.9127 0.8727 0.7021 1.1081 0.1313 0.3777 0.4790 0.1622 0.3497 0.1791 0.1229 0.9816 3.8831 0.7139 0.2668 0.0135 1.3925 0.7160 0.6776 0.9368 1.0985 1.0714 1.7854 1.2368 5.7824 4.5009 2.7231 0.0668 2.9885 20.2299 13.6669 22.1182 6.7819 24.0016 12.9582 5.8953 10.7459 6.3464 59.1517 79.4439 25.8821 42.5619 28.3817 7.6489 10.5028 10.9024 0.3302 4.8004 0.1462 11.7863 8.2388 4.1300 97.5426 19.8629 122.2525 5.0224 138.0139 10.9048 95.9743 5.8521 6.5119 25.7039 24.5612 2.2615 14.7909 87.0568 0.2838 11.7107 7.6420 9.5873 197.1910 51.4484 17.5304 8.8196 39.0702 15.7261 49.3594 40.4005 3.4685 55.9800 37.1883 10.0917 263.6570 30.0107 5.3709 17.8012 12.3788 8.9400 6.5335 11.3863 13.3908 11.7045 8.3443 4.4048 263.3761 175.7696 45.2605 22.6968 19.7435 26.9805 5.1395 27.3960 20.6036 1.8578 1.2823 2.2431 41.8695 67.3867 35.9827 7.2619 20.4959 12.4178 0.2403 33.7856
temp: 298.150 k
press: 1.00000 atm
elementType: 53 53 53 8 8 8 8 7 6 6 6 6 6 6 6 6 6 6 6 6 6 6 6 1 1 1 1 1 1 1 1 1 1 1 1 1 1 1 1 1 1
symmnumber: 1
zpe: 795239.1 jmol-1
zpe.correction: 0.302891 hartree
zpe.thermalcorrener: 0.330189 hartree
zpe.thermalcorrenthalpy: 0.331133 hartree
zpe.thermalcorrgfe: 0.238818 hartree
zpe.sumelectzpe: -970.811666 hartree
zpe.sumelectthermal: -970.784368 hartree
zpe.sumelectthermalent: -970.783424 hartree
zpe.sumelectthermalfe: -970.875739 hartree
dipole: -4.2442 0.0869 1.7269
dipole: 4.5829
quadrupole: -184.4374 -179.5931 -170.9686
quadrupole: -16.2475 -2.0833 6.1441
quadrupole: -6.1044 -1.2600 7.3644 -16.2475 -2.0833 6.1441
hfenergy: -971.1145566 hartree
pointgroup: C01 [X(C15H18I3N1O4)]
dipole: -1.6594099 -0.1918533 -0.6786674 debye
polarizability: 346.6527817|-8.4289706|273.8752274|-3.1012689|-34.5001151|178.0498069 unknown
InChI: InChI=1S/C15H18I3NO4/c1-4-6-11(15(21)22)23-14-10(17)7-9(16)13(12(14)18)19(5-2)8(3)20/h7,11,21H,4-6H2,1-3H3
charge 0 multiplicity 1
41 atoms
I  0.253818 -1.911223 1.430685
I  4.02881 2.489315 -0.717673
I  -1.924102 3.598472 -0.290211
O  -1.9118 0.500634 0.524797
O  -3.296198 -1.336558 -2.379456
O  -2.03834 0.618472 -2.334445
O  4.756408 -1.388536 1.510167
N  2.95544 -0.527627 0.326403
C  -3.990609 -0.732458 0.391513
C  -2.581824 -0.592498 -0.218266
C  -4.90219 0.499011 0.199255
C  1.873447 0.398928 0.182502
C  -0.583209 0.8516 0.247369
C  0.529379 -0.006249 0.463232
C  3.140209 -1.583618 -0.717445
C  -6.284214 0.290161 0.853475
C  -2.589907 -0.317339 -1.725665
C  2.072598 1.74123 -0.245143
C  -0.320945 2.199741 -0.121979
C  0.992136 2.641925 -0.362174
C  3.808776 -0.55158 1.449396
C  4.184169 -1.228088 -1.793159
C  3.521353 0.441137 2.568766
H  -4.459036 -1.625868 -0.062369
H  -3.856854 -0.93739 1.470792
H  -2.031063 -1.542748 -0.067564
H  -4.408647 1.389335 0.628713
H  -5.033224 0.699285 -0.883359
H  2.154413 -1.771326 -1.179437
H  3.457145 -2.498197 -0.186644
H  -6.805223 -0.58462 0.420205
H  -6.931058 1.174175 0.708996
H  -6.186816 0.119148 1.942191
H  1.171345 3.676322 -0.660502
H  3.873172 -0.361615 -2.401847
H  5.155958 -1.002413 -1.324182
H  4.319092 -2.093442 -2.468825
H  2.443376 0.531781 2.786514
H  3.903345 1.444865 2.307728
H  4.050837 0.094136 3.468597
H  -3.272567 -1.17758 -3.36205
