program: Gaussian 09
title: 000212498
version: EM64L-G09RevD.01
frameworkgroup: C1[X(C13H14I3NO4)]
method: RPBEPBE
basis: SDD
operation: Freq
keyword: #p
keyword: freq=noraman
keyword: PBEPBE/SDD
title: #p freq=noraman PBEPBE/SDD
converged: NO YES NO NO
title: Mulliken charges:
elementType: I I I O O O O N C C C C C C C C C C C C C H H H H H H H H H H H H H H
charge: 0.155619 0.148271 0.154483 -0.283250 -0.262558 -0.414975 -0.203664 -0.246483 0.669104 -0.344982 -0.626905 0.652158 -0.540850 -0.053642 0.191231 -0.541800 -0.110227 -0.661988 -0.683435 -0.762987 0.188039 0.259170 0.221623 0.243750 0.277865 0.222235 0.256250 0.215935 0.244890 0.248072 0.239973 0.249746 0.249280 0.262221 0.387832
chargesum: 0.00000
title: Mulliken charges with hydrogens summed into heavy atoms:
elementType: I I I O O O O N C C C C C C C C C C C C C
charge: 0.155619 0.148271 0.154483 -0.283250 -0.262558 -0.027143 -0.203664 -0.246483 0.669104 0.135811 -0.626905 0.652158 -0.540850 0.190108 0.191231 -0.541800 0.167638 0.032432 0.049499 -0.001740 0.188039
polarizability: 3.10992885e+02 3.04545393e+00 2.67515074e+02 9.39946566e+00 -4.39763091e+00 1.48403381e+02
1716.lowfreq: -15.0261 -10.1555 -7.7631 -0.0004 -0.0002 0.0003 6.6936 15.5832 22.3294
frequency: -12.3702 13.6514 21.7860 37.3279 40.9650 53.9748 63.2705 72.7302 76.9248 84.5157 96.7121 98.9303 110.6179 136.0630 154.7286 162.2357 178.2246 191.8211 194.4618 210.6242 227.5129 235.6728 256.1665 286.5130 306.8639 326.6895 371.8845 389.2187 429.9206 453.7775 467.8851 479.9968 518.4579 551.1735 559.6505 583.6832 598.3413 611.2950 630.6661 679.1492 687.1120 703.8114 750.1615 762.9290 775.8331 819.5811 879.7924 907.5669 913.5381 991.9486 1004.7462 1010.5103 1020.2573 1031.3881 1034.8529 1086.2656 1096.4500 1101.9413 1126.0737 1151.7159 1204.0372 1242.3063 1254.3953 1276.3929 1278.9755 1295.9805 1315.4871 1328.3050 1360.5753 1366.3497 1381.7660 1386.1583 1388.9149 1403.4241 1444.6948 1448.1856 1461.1208 1464.0895 1469.5042 1477.4922 1477.7769 1507.2087 1530.0520 1606.7532 1674.3359 2989.7229 2993.6783 2999.4726 3010.1431 3012.5575 3072.8323 3081.0581 3085.9613 3111.7715 3115.0266 3124.2766 3129.9899 3185.3845 3516.5451
redmass: 3.0539 4.6777 8.2450 5.3316 7.8595 5.0191 9.7944 2.6385 7.1484 18.1235 2.2250 7.9627 6.1603 2.2695 5.3871 57.6448 2.3992 5.6880 2.6130 1.1299 2.6992 3.4301 3.7962 4.2217 4.7897 4.2679 3.5793 5.2186 5.7154 6.6520 4.9870 5.1313 4.0022 4.2519 2.2537 3.3350 2.7517 3.4085 5.3662 7.4314 4.5064 6.1742 8.3243 1.5738 2.3475 3.3726 1.3823 3.2693 2.6259 1.8123 2.6305 3.9619 3.4909 2.4035 1.6511 2.4902 2.2081 2.8604 2.0120 1.9842 2.1407 3.3561 1.5600 2.2494 1.4935 4.0235 3.6336 1.8158 1.3260 2.2938 1.2747 1.2214 1.2201 3.3452 1.1313 1.0634 1.0504 1.0469 1.0520 1.0530 1.0511 10.7513 8.5691 7.1492 9.4854 1.0364 1.0375 1.0823 1.0347 1.0596 1.1032 1.0980 1.0980 1.1024 1.1015 1.1010 1.0991 1.0930 1.0643
irintensity: 0.0944 0.1472 0.4571 1.0411 1.0723 0.8166 0.8665 2.0789 0.3548 0.4413 0.5917 0.1318 0.7304 2.9015 0.3994 0.0053 0.5668 3.6979 0.2632 0.2971 0.3414 1.6317 2.5587 0.4670 7.0606 3.6601 1.6170 0.6269 11.6478 15.4021 10.7325 13.5131 22.0314 11.6726 52.9007 14.6852 19.9088 55.6212 31.0285 27.3851 31.1460 23.3013 15.1264 23.1676 7.7222 2.3626 12.2590 18.4152 8.7905 22.0378 6.8115 249.7329 202.8268 19.0479 6.6285 7.7849 4.6706 28.9735 4.6556 14.8549 89.7863 12.5574 12.2583 182.0600 14.4371 49.2953 30.6373 35.2577 29.9149 59.8198 59.6692 34.7680 20.3036 249.9545 35.4810 11.5172 12.4330 9.3438 14.2361 10.3520 16.9455 8.9993 5.0578 258.3759 180.9530 27.6917 5.5195 26.8445 11.0898 20.4764 1.6090 5.7477 35.6793 20.6050 11.5114 10.8133 11.5703 0.2655 33.2602
temp: 298.150 k
press: 1.00000 atm
elementType: 53 53 53 8 8 8 8 7 6 6 6 6 6 6 6 6 6 6 6 6 6 1 1 1 1 1 1 1 1 1 1 1 1 1 1
symmnumber: 1
zpe: 647737.5 jmol-1
zpe.correction: 0.246710 hartree
zpe.thermalcorrener: 0.270460 hartree
zpe.thermalcorrenthalpy: 0.271404 hartree
zpe.thermalcorrgfe: 0.187614 hartree
zpe.sumelectzpe: -892.365108 hartree
zpe.sumelectthermal: -892.341358 hartree
zpe.sumelectthermalent: -892.340414 hartree
zpe.sumelectthermalfe: -892.424204 hartree
dipole: -4.3393 0.4432 1.7955
dipole: 4.7170
quadrupole: -171.2763 -163.6200 -158.7690
quadrupole: -16.7341 -2.1151 6.4029
quadrupole: -6.7212 0.9351 5.7861 -16.7341 -2.1151 6.4029
hfenergy: -892.6118182 hartree
pointgroup: C01 [X(C13H14I3N1O4)]
dipole: 1.7487541 0.031645 -0.6203768 debye
polarizability: 308.1621118|-10.5470182|266.6781871|16.7464393|16.5570343|152.0710411 unknown
InChI: InChI=1S/C13H14I3NO4/c1-4-17(7(3)18)11-8(14)5-9(15)12(10(11)16)21-6(2)13(19)20/h5-6,19H,4H2,1-3H3
charge 0 multiplicity 1
35 atoms
I  0.254463 2.157939 1.26878
I  -3.518314 -2.437148 -0.455007
I  2.331198 -3.61941 0.637826
O  2.357714 -0.446382 1.049932
O  -4.240715 1.787563 1.116001
O  4.009186 1.002868 -1.935184
O  2.649495 -0.879303 -1.780825
N  -2.416845 0.683582 0.199641
C  -1.36226 -0.282056 0.28708
C  -2.494518 1.558466 -1.011105
C  -0.031943 0.125078 0.62615
C  1.055269 -0.788492 0.66288
C  -1.577048 -1.668344 0.048356
C  3.212762 0.459778 0.251615
C  -3.331208 0.917365 1.247787
C  0.77511 -2.168136 0.459851
C  -0.526538 -2.60486 0.158145
C  -3.496958 1.066243 -2.071942
C  4.603674 0.366389 0.89721
C  -3.149538 0.104033 2.523436
C  3.229714 0.076039 -1.231683
H  -2.793263 2.560998 -0.658321
H  -1.477801 1.626575 -1.438009
H  2.831934 1.497272 0.319524
H  -0.719693 -3.666218 -0.006649
H  -3.207909 0.084759 -2.484539
H  -4.506153 0.982916 -1.636171
H  -3.537579 1.794912 -2.903139
H  4.980124 -0.668751 0.845715
H  4.528625 0.65983 1.957026
H  5.305442 1.041357 0.38123
H  -2.108375 0.141527 2.890149
H  -3.41662 -0.955965 2.362368
H  -3.821127 0.522287 3.287444
H  4.019099 0.766794 -2.902274
