program: Gaussian 09
title: 000212413
version: EM64L-G09RevD.01
frameworkgroup: C1[X(C18H37N3O2)]
method: RPBEPBE
basis: SDD
operation: Freq
keyword: #p
keyword: freq=noraman
keyword: PBEPBE/SDD
title: #p freq=noraman PBEPBE/SDD
converged: YES YES NO NO
title: Mulliken charges:
elementType: O O N N N C C C C C C C C C C C C C C C C C C H H H H H H H H H H H H H H H H H H H H H H H H H H H H H H H H H H H H H
charge: -0.327770 -0.315128 -0.081312 -0.105429 -0.145785 -0.354600 -0.347532 -0.325090 -0.395851 -0.391534 -0.404658 -0.366375 -0.367501 -0.352649 -0.356369 0.310469 -0.340498 -0.340683 -0.694538 -0.693852 0.056200 -0.689776 -0.685741 0.206123 0.198117 0.185810 0.212214 0.189788 0.207173 0.210762 0.208075 0.215033 0.250899 0.252189 0.219978 0.200531 0.184039 0.201763 0.182037 0.205320 0.186961 0.208792 0.184146 0.190548 0.192116 0.190725 0.191736 0.211832 0.215135 0.209798 0.212167 0.215260 0.209467 0.232541 0.231273 0.206896 0.218200 0.256849 0.208485 0.213225
chargesum: 0.00000
title: Mulliken charges with hydrogens summed into heavy atoms:
elementType: O O N N N C C C C C C C C C C C C C C C C C C
charge: -0.327770 -0.315128 -0.081312 -0.105429 -0.145785 0.049640 0.050492 0.071871 0.022985 0.074398 0.067509 0.018196 0.016299 0.039631 0.036569 0.310469 0.042165 0.041778 -0.057773 -0.056957 0.288741 -0.033408 -0.007182
polarizability: 2.80291022e+02 2.86761495e+00 2.26450383e+02 7.68414690e+00 -2.05609418e+00 1.82095971e+02
1716.lowfreq: -14.2121 -10.6717 -4.2381 -1.5857 -0.0011 -0.0009 0.0010 10.5031 16.6072
frequency: -9.5722 10.1260 16.1364 27.2825 34.1462 45.1941 49.2606 51.3681 62.2766 72.3713 89.3280 95.5835 107.2175 111.2727 120.3866 148.8208 166.9672 182.2575 193.3745 206.7446 209.9644 227.1535 230.7819 246.2791 259.8051 270.5924 277.7070 296.6585 306.0592 325.2070 347.8905 371.1181 386.6730 405.8336 412.3903 441.3668 442.5251 470.2560 485.1633 507.1872 525.4922 580.4223 632.0301 690.6414 729.3852 731.1074 760.0267 770.6941 784.2909 790.7436 793.3661 803.5391 834.7072 845.3310 896.8641 898.9403 901.5070 924.5024 924.7163 927.3119 939.7177 945.7560 985.2555 998.0600 1002.5621 1022.7991 1049.1133 1052.0159 1057.6839 1062.9318 1072.8950 1077.5380 1084.9788 1094.5276 1103.1242 1106.7327 1111.6855 1120.1677 1135.4603 1142.8076 1155.1149 1171.9054 1180.0494 1191.1316 1196.4475 1210.2272 1222.6078 1230.9624 1236.8409 1244.9527 1266.6461 1268.4097 1274.3896 1282.0591 1282.6317 1283.9146 1287.8590 1297.6961 1303.5880 1316.7807 1326.9721 1333.9621 1337.6467 1342.6455 1343.1689 1349.6798 1364.4593 1368.5614 1372.3462 1375.3438 1377.3218 1386.9186 1390.2822 1393.0690 1394.3641 1412.0582 1452.0993 1456.6352 1460.1461 1461.4925 1463.4931 1463.7149 1464.1613 1466.3445 1470.1768 1470.6881 1471.8495 1473.1896 1476.5059 1476.5388 1478.7115 1480.8608 1483.6563 1487.8186 1488.6792 1489.6421 1633.4839 2842.4338 2848.1485 2852.0453 2855.3793 2877.2415 2900.7055 2960.8053 2961.2197 2971.5061 2971.6394 2973.3326 2974.8204 2975.4805 2978.4821 2986.3785 2990.6013 3002.2575 3002.7758 3012.2551 3014.2962 3017.5279 3028.7347 3031.8719 3038.6221 3043.3763 3044.6048 3052.3071 3068.6624 3069.2924 3071.3208 3071.7143 3080.7248 3091.0387 3093.6685 3096.4952 3103.9443 3117.5151
redmass: 3.7012 3.9496 3.5278 3.1255 3.5155 2.6707 1.7070 2.1364 2.4415 3.2861 4.1284 2.7717 2.3630 4.7407 3.5125 2.8049 2.4940 3.3157 1.0983 2.0207 2.1849 1.1612 1.1234 1.1628 2.8841 2.4390 2.7903 2.8012 2.4008 2.8228 3.1235 2.9807 3.4867 2.5028 2.5447 2.7917 2.9458 2.7660 2.9311 3.0956 3.6288 3.7416 2.3174 11.2276 1.0777 1.0742 3.7558 3.7502 1.3053 1.2145 1.1865 3.5566 2.2072 2.2927 1.7401 1.7481 2.5388 1.2310 1.2504 1.2469 1.3622 2.1767 3.4998 2.5971 3.0721 3.2166 1.9180 2.5758 2.3153 2.5455 2.3858 2.2569 2.3644 2.2276 2.1705 1.8259 2.2893 2.4150 2.4513 2.2541 2.0384 2.0399 1.9438 1.9916 1.1069 1.8947 1.5028 1.9068 1.5401 1.4298 1.3308 1.3162 1.5243 1.0822 1.3360 1.0872 1.1745 1.2928 1.2940 1.3901 1.3253 1.2819 1.3186 1.5111 1.5335 1.3570 1.3710 1.4016 1.4023 1.4134 1.2671 1.2255 1.2299 1.4107 1.2362 2.7923 1.0823 1.0532 1.0811 1.0786 1.0708 1.0722 1.0590 1.0876 1.0803 1.0783 1.0856 1.0517 1.0424 1.0431 1.0785 1.0673 1.0780 1.0488 1.0874 1.0885 9.6779 1.0712 1.0714 1.0709 1.0702 1.0693 1.0695 1.0588 1.0589 1.0421 1.0508 1.0444 1.0581 1.0686 1.0682 1.0356 1.0359 1.0967 1.0969 1.0886 1.0874 1.0891 1.0865 1.0894 1.0954 1.0991 1.1004 1.0887 1.1006 1.1006 1.0995 1.0994 1.0993 1.0986 1.0948 1.1003 1.1005 1.0930
irintensity: 0.5281 0.0172 0.0346 0.0176 0.0156 0.1631 0.2222 0.1633 0.7019 1.1610 2.7547 0.2336 0.1491 0.6840 0.1704 0.6722 0.5444 0.2997 0.4215 6.9382 3.7426 0.2159 0.0126 0.7420 1.9301 0.9205 1.7790 1.3970 6.9028 4.9431 1.6581 7.0957 9.3365 1.5405 0.4078 1.9293 10.5577 1.8258 4.2181 2.6253 5.7912 1.3401 1.1325 16.5830 9.0381 8.4714 4.6043 12.3851 1.4598 0.3160 0.9995 24.7861 2.6453 3.9300 13.4135 7.7170 18.9402 4.7281 7.0038 3.1756 0.1470 3.5887 73.3320 88.2037 21.0297 6.2512 1.6119 36.3401 36.2752 70.0852 2.1833 12.7553 48.2801 26.9691 123.0383 57.7236 1.3027 39.1446 76.3133 18.2701 12.5144 35.3840 54.8367 16.7447 2.2098 51.4249 209.7906 39.4529 0.6091 11.3378 0.7554 1.3516 31.5532 2.4112 43.4770 0.3618 6.1612 12.3325 11.6584 5.7166 9.5963 0.3288 6.2975 0.7026 1.0359 0.6642 7.5503 15.2646 0.3411 9.2777 32.8712 6.8669 8.8566 3.6956 25.9371 166.3680 5.3672 5.9215 4.6993 12.1791 2.7314 7.0713 8.8239 12.8415 3.8011 0.8892 0.5725 5.8076 12.8290 12.0342 6.4116 3.4650 8.6178 23.4315 14.6239 11.0121 435.7511 42.6906 46.1091 160.9949 45.7539 59.4556 139.6667 21.7946 21.5704 30.9824 35.5948 49.7734 54.9120 19.8024 82.2454 16.5899 26.2984 11.5256 7.2178 10.3101 5.2720 9.0417 7.1108 26.7597 49.1665 50.3658 79.7660 54.0932 83.7683 101.4459 53.2034 60.0032 6.0650 67.0315 5.6441 26.2364 25.7119 5.2585
temp: 298.150 k
press: 1.00000 atm
elementType: 8 8 7 7 7 6 6 6 6 6 6 6 6 6 6 6 6 6 6 6 6 6 6 1 1 1 1 1 1 1 1 1 1 1 1 1 1 1 1 1 1 1 1 1 1 1 1 1 1 1 1 1 1 1 1 1 1 1 1 1
symmnumber: 1
zpe: 1402850.5 jmol-1
zpe.correction: 0.534318 hartree
zpe.thermalcorrener: 0.561908 hartree
zpe.thermalcorrenthalpy: 0.562853 hartree
zpe.thermalcorrgfe: 0.472062 hartree
zpe.sumelectzpe: -1020.902836 hartree
zpe.sumelectthermal: -1020.875245 hartree
zpe.sumelectthermalent: -1020.874301 hartree
zpe.sumelectthermalfe: -1020.965091 hartree
dipole: -1.7182 -1.8789 0.4098
dipole: 2.5789
quadrupole: -140.9012 -145.8196 -145.2990
quadrupole: -11.8880 8.2468 -0.0676
quadrupole: 3.1054 -1.8130 -1.2924 -11.8880 8.2468 -0.0676
hfenergy: -1021.4371533 hartree
pointgroup: C01 [X(C18H37N3O2)]
dipole: -0.6768521 -0.7471074 0.1145695 debye
polarizability: 280.3389944|2.2813231|226.5225021|7.5957621|0.8224579|181.9758804 unknown
InChI: InChI=1S/C18H37N3O2/c1-5-7-9-19(10-8-6-2)11-12-20-13-15-21(16-14-20)18(22)23-17(3)4/h17H,5-16H2,1-4H3
charge 0 multiplicity 1
60 atoms
O  5.233109 -0.600325 0.046585
O  4.932381 1.674584 -0.494046
N  0.370972 -0.337939 -0.609426
N  -3.428872 -0.047413 -0.332981
N  3.202819 0.113558 -0.775659
C  -0.984784 -0.435919 -0.010935
C  1.327279 -1.283005 0.022279
C  0.919792 1.042838 -0.578719
C  -2.077184 0.234621 -0.874564
C  2.681537 -1.265362 -0.713691
C  2.263907 1.108677 -1.327225
C  -3.989064 -1.346745 -0.785101
C  -4.376641 1.088266 -0.458145
C  -4.918081 -2.001899 0.259559
C  -4.128907 2.195155 0.588408
C  4.478474 0.496977 -0.418027
C  -5.540338 -3.325758 -0.240406
C  -5.084941 3.399203 0.425609
C  -6.445853 -3.996299 0.815206
C  -4.838646 4.503239 1.476383
C  6.628987 -0.280841 0.502133
C  7.403134 -1.594764 0.366848
C  6.582028 0.270101 1.934892
H  -1.229499 -1.51084 0.087453
H  -1.030325 -0.00045 1.018188
H  1.498376 -1.036359 1.101913
H  0.902703 -2.302781 -0.030247
H  1.065854 1.398188 0.474018
H  0.2098 1.7290 -1.072693
H  -1.957122 -0.111161 -1.928969
H  -1.928788 1.32977 -0.879694
H  2.533163 -1.645197 -1.745295
H  3.414976 -1.903161 -0.200249
H  2.724442 2.105075 -1.232491
H  2.090299 0.893026 -2.401028
H  -3.144847 -2.035582 -0.982549
H  -4.537513 -1.240747 -1.756423
H  -5.401643 0.696465 -0.315522
H  -4.352016 1.53571 -1.48546
H  -4.334817 -2.179577 1.184229
H  -5.730854 -1.299518 0.535021
H  -4.23929 1.752932 1.597668
H  -3.081106 2.552785 0.518352
H  -4.729948 -4.026107 -0.530611
H  -6.126482 -3.131552 -1.162205
H  -4.970307 3.824739 -0.59278
H  -6.134742 3.047324 0.498009
H  -5.876496 -4.229241 1.734681
H  -6.879439 -4.940454 0.437146
H  -7.282407 -3.330548 1.100358
H  -4.978025 4.112155 2.501767
H  -5.531843 5.353793 1.34113
H  -3.805929 4.894031 1.405328
H  7.024488 0.49212 -0.18265
H  7.377877 -1.958865 -0.674501
H  8.457796 -1.442266 0.659645
H  6.969932 -2.372862 1.02041
H  6.004281 1.208878 1.967146
H  7.606503 0.482328 2.29292
H  6.119845 -0.464801 2.618308
