program: Gaussian 09
title: 000212391
version: EM64L-G09RevD.01
frameworkgroup: C1[X(C15H31N3O2)]
method: RPBEPBE
basis: SDD
operation: Freq
keyword: #p
keyword: freq=noraman
keyword: PBEPBE/SDD
title: #p freq=noraman PBEPBE/SDD
converged: YES YES NO NO
title: Mulliken charges:
elementType: O O N N N C C C C C C C C C C C C C C C H H H H H H H H H H H H H H H H H H H H H H H H H H H H H H H
charge: -0.322373 -0.311548 -0.082486 -0.141817 -0.087855 -0.347340 -0.325796 -0.390553 -0.402199 -0.340334 -0.380063 0.303295 -0.312695 -0.388405 -0.277142 -0.042361 -0.700426 -0.687204 -0.691763 -0.698612 0.187578 0.212567 0.208765 0.190605 0.214301 0.252131 0.252456 0.219439 0.204954 0.194747 0.208696 0.201712 0.203494 0.184360 0.213687 0.219252 0.208774 0.235070 0.205888 0.210896 0.214930 0.228623 0.215698 0.220197 0.223283 0.216712 0.228031 0.207720 0.211222 0.219136 0.212754
chargesum: 0.00000
title: Mulliken charges with hydrogens summed into heavy atoms:
elementType: O O N N N C C C C C C C C C C C C C C C
charge: -0.322373 -0.311548 -0.082486 -0.141817 -0.087855 0.052806 0.073575 0.075880 0.069696 0.059366 0.030345 0.303295 0.075160 0.044533 0.166702 0.163526 -0.045977 -0.028027 -0.039301 -0.055499
polarizability: 2.59619341e+02 1.92830809e+00 1.76435486e+02 6.54873284e+00 -9.36220208e-01 1.51051596e+02
1716.lowfreq: -20.1108 -13.4748 -4.5737 -0.0009 -0.0003 0.0012 5.0426 15.2413 22.9363
frequency: 2.8423 10.5333 22.4988 27.0490 42.5739 51.1437 58.2965 63.1282 87.4765 99.0749 110.9592 151.9795 167.8028 195.3958 200.6666 219.6890 222.9361 228.4188 241.6068 255.2883 266.6370 280.3453 290.5750 314.3812 337.9024 351.0426 370.7343 403.5707 409.8259 412.8354 431.6629 466.3661 492.8184 504.4868 561.8173 574.3756 627.5117 685.2011 731.4582 747.7289 771.4415 776.1810 786.8336 806.2825 812.2294 841.1093 889.1068 894.9837 917.4240 920.7769 944.2633 954.4592 964.1962 972.1649 997.4380 1004.0256 1035.2136 1051.4086 1055.0896 1061.8398 1063.1417 1075.2380 1081.9303 1099.9284 1114.6273 1130.2757 1133.4728 1139.6589 1167.9732 1172.3537 1186.0916 1198.6793 1202.4537 1215.1872 1225.2076 1246.8645 1254.7387 1270.3582 1277.9146 1284.5719 1293.7333 1296.2675 1317.4963 1332.5923 1334.8569 1340.7088 1345.4171 1348.3157 1352.6612 1366.3645 1367.5689 1374.9957 1378.4598 1378.5326 1384.3764 1391.9096 1395.1493 1412.4377 1453.2893 1457.2416 1457.5621 1460.3095 1462.0981 1465.2224 1467.3704 1468.8471 1470.0270 1471.2460 1474.3312 1478.9820 1481.2172 1482.2356 1489.2147 1489.5485 1496.8323 1642.6594 2849.9868 2856.4199 2857.2700 2879.7510 2901.3051 2970.5056 2974.9130 2977.2790 2978.7726 2979.9577 2981.7309 2983.3029 2988.6363 3005.1564 3012.9875 3016.2212 3033.2088 3036.3465 3040.3063 3051.4953 3062.5495 3071.3696 3072.2684 3075.6460 3076.4603 3080.1229 3080.6100 3083.1497 3088.4266 3096.0641 3118.4076
redmass: 3.5445 3.6208 3.6105 3.1900 3.5150 2.6891 2.8598 3.3041 3.2838 5.3608 2.6270 2.2467 1.9107 2.2236 1.1493 2.4127 1.1255 1.9236 1.5222 2.0984 1.9348 1.9298 2.8338 2.4020 2.5313 3.9722 2.7394 2.2596 1.9615 2.0630 3.5658 2.7562 2.8960 2.6266 4.9354 3.6709 2.2583 11.4139 3.0118 4.5510 1.1439 2.5795 1.2257 1.2962 2.6248 1.5607 2.8977 2.0082 1.4554 1.2518 1.9960 1.9889 1.6132 2.5108 2.7352 3.4710 2.5438 1.8934 2.1074 2.0849 2.2266 2.5731 2.1746 2.3614 1.7678 2.4345 2.2993 2.7305 1.9058 2.0973 1.8278 1.1213 1.9513 2.0582 2.3284 1.4748 1.1941 1.3217 1.2743 1.3322 1.3344 1.3374 1.3374 1.2929 1.2955 1.2394 1.3768 1.3593 1.3503 1.3942 1.3664 1.3643 1.2164 1.2215 1.2471 1.4201 1.2535 2.3489 1.0761 1.0656 1.0815 1.0867 1.0852 1.0870 1.0514 1.0515 1.0755 1.0828 1.0648 1.0598 1.0545 1.0528 1.0800 1.0531 1.0770 9.1603 1.0713 1.0715 1.0701 1.0695 1.0688 1.0356 1.0691 1.0351 1.0363 1.0671 1.0839 1.0382 1.0588 1.0568 1.0869 1.0866 1.0917 1.0965 1.0951 1.0888 1.1003 1.1011 1.0989 1.1017 1.0992 1.1007 1.1024 1.1010 1.1005 1.0950 1.0930
irintensity: 0.0761 0.4447 0.0711 0.1651 0.4735 0.3080 0.1947 0.9382 0.7553 1.8870 0.1793 0.5136 3.1859 0.3449 0.1660 3.6760 0.0731 2.5504 1.6677 1.9850 0.6037 0.8003 3.7012 5.8448 6.8977 24.3842 1.4472 2.6918 2.1721 1.6264 2.2233 1.5779 10.6434 7.6589 4.2845 1.5299 1.0175 18.0390 9.6569 21.0703 6.0763 0.9984 2.8563 7.3610 4.4073 0.5358 6.6309 3.9669 8.7719 15.0099 2.4660 10.6721 8.0890 11.6243 153.4635 79.3543 32.4924 40.5709 28.1431 6.7751 79.7033 34.4682 26.3613 29.0279 28.3197 96.1249 2.5698 50.2335 6.2984 18.7777 2.4371 3.5018 46.3264 178.5074 138.8894 13.8014 0.2232 9.7244 37.4087 39.9242 0.1363 7.3244 16.0880 1.0992 1.6192 7.0483 3.1467 9.0803 5.4117 5.3043 6.1757 0.7889 1.9196 40.1212 22.7481 1.3865 31.6701 156.1857 4.7319 6.2767 15.2531 9.9754 9.9034 22.7744 9.0987 5.2935 19.2780 17.5420 6.6043 7.6418 1.4700 11.5668 14.2157 26.8838 1.0640 414.8213 44.5110 134.1182 28.4978 61.6948 130.1749 37.5998 26.5967 27.8552 15.9079 71.5967 15.9292 26.5970 48.4437 51.5345 22.2605 2.2140 7.3609 23.9027 81.5663 46.2625 26.6166 3.7147 45.3606 59.7214 72.4903 53.3124 39.7347 51.7509 43.8143 5.9425 5.0163
temp: 298.150 k
press: 1.00000 atm
elementType: 8 8 7 7 7 6 6 6 6 6 6 6 6 6 6 6 6 6 6 6 1 1 1 1 1 1 1 1 1 1 1 1 1 1 1 1 1 1 1 1 1 1 1 1 1 1 1 1 1 1 1
symmnumber: 1
zpe: 1184772.4 jmol-1
zpe.correction: 0.451256 hartree
zpe.thermalcorrener: 0.475383 hartree
zpe.thermalcorrenthalpy: 0.476327 hartree
zpe.thermalcorrgfe: 0.391641 hartree
zpe.sumelectzpe: -903.228611 hartree
zpe.sumelectthermal: -903.204485 hartree
zpe.sumelectthermalent: -903.203540 hartree
zpe.sumelectthermalfe: -903.288226 hartree
dipole: 1.6986 -1.7776 0.6977
dipole: 2.5557
quadrupole: -115.5099 -125.9246 -126.6708
quadrupole: 11.1382 0.8750 0.3531
quadrupole: 7.1919 -3.2229 -3.9690 11.1382 0.8750 0.3531
hfenergy: -903.6798671 hartree
pointgroup: C01 [X(C15H31N3O2)]
dipole: -0.683439 -0.7290644 -0.1114685 debye
polarizability: 259.5145402|-2.1525182|175.6008254|7.1069994|-4.9099758|151.9910582 unknown
InChI: InChI=1S/C15H31N3O2/c1-5-16(6-2)7-8-17-9-11-18(12-10-17)15(19)20-13-14(3)4/h14H,5-13H2,1-4H3
charge 0 multiplicity 1
51 atoms
O  3.67078 -0.640704 0.532958
O  3.368743 1.677948 0.204088
N  -1.186949 -0.316419 -0.01827
N  1.64075 0.147587 -0.211794
N  -4.984507 -0.083422 0.308803
C  -0.218363 -1.314792 0.502807
C  -0.635325 1.055998 0.125167
C  1.116259 -1.230971 -0.264218
C  0.690395 1.188835 -0.647502
C  -2.532018 -0.470964 0.591789
C  -3.634553 0.289268 -0.183184
C  2.917428 0.49895 0.16986
C  -5.500141 -1.327946 -0.31526
C  -5.948287 1.044261 0.360009
C  5.081487 -0.398843 0.933131
C  6.049854 -0.977514 -0.116413
C  -6.691364 -1.943317 0.442606
C  -6.413726 1.620537 -1.006745
C  5.886906 -0.277874 -1.484189
C  7.498201 -0.851171 0.415511
H  -0.018355 -1.165727 1.595154
H  -0.646702 -2.325684 0.370324
H  -1.355623 1.784073 -0.287239
H  -0.462489 1.31502 1.201583
H  0.938183 -1.51122 -1.322617
H  1.860693 -1.914879 0.167221
H  1.154973 2.172879 -0.475834
H  0.489331 1.068108 -1.731192
H  -2.778594 -1.549465 0.583686
H  -2.556882 -0.144002 1.660787
H  -3.508286 1.378941 -0.040371
H  -3.49704 0.087643 -1.27218
H  -4.671426 -2.061007 -0.319235
H  -5.77978 -1.173665 -1.388491
H  -5.477047 1.851743 0.952863
H  -6.833923 0.718183 0.936399
H  5.198984 -0.909834 1.905463
H  5.231209 0.68977 1.056244
H  5.811546 -2.05403 -0.239013
H  -6.955128 -2.924017 0.005486
H  -7.592115 -1.305496 0.392088
H  -6.431435 -2.089532 1.506004
H  -7.099341 2.473671 -0.846682
H  -6.952978 0.86448 -1.605856
H  -5.556614 1.982304 -1.604439
H  6.090347 0.80582 -1.396952
H  4.860433 -0.398426 -1.873437
H  6.586291 -0.703501 -2.227166
H  7.624219 -1.362791 1.388545
H  8.214058 -1.298534 -0.297466
H  7.777218 0.211628 0.54907
