program: Gaussian 09
title: 000212387
version: EM64L-G09RevD.01
frameworkgroup: C1[X(C14H29N3O2)]
method: RPBEPBE
basis: SDD
operation: Freq
keyword: #p
keyword: freq=noraman
keyword: PBEPBE/SDD
title: #p freq=noraman PBEPBE/SDD
converged: YES YES NO NO
title: Mulliken charges:
elementType: O O N N N C C C C C C C C C C C C C C H H H H H H H H H H H H H H H H H H H H H H H H H H H H H
charge: -0.328305 -0.315052 -0.084276 -0.147379 -0.105239 -0.352355 -0.340575 -0.353628 -0.388557 -0.395532 -0.379229 0.310727 -0.321180 -0.323111 -0.672675 -0.674757 0.055999 -0.685408 -0.690335 0.215615 0.188551 0.207105 0.188298 0.222832 0.183763 0.219004 0.251207 0.216030 0.251685 0.195110 0.219182 0.186280 0.202929 0.186305 0.204933 0.226878 0.210636 0.205712 0.227355 0.208121 0.205702 0.232815 0.214068 0.256618 0.208049 0.218846 0.229904 0.207334
chargesum: 0.00000
title: Mulliken charges with hydrogens summed into heavy atoms:
elementType: O O N N N C C C C C C C C C C C C C C
charge: -0.328305 -0.315052 -0.084276 -0.147379 -0.105239 0.051811 0.054828 0.052968 0.081654 0.072183 0.035064 0.310727 0.068028 0.068127 -0.029450 -0.033579 0.288814 -0.006673 -0.034250
polarizability: 2.38471312e+02 -4.53166339e+00 1.69935594e+02 -3.01150773e+00 -2.49688813e+00 1.47840958e+02
1716.lowfreq: -9.0249 -1.7991 -0.0007 -0.0007 -0.0003 7.4837 16.3415 23.4691 31.1375
frequency: 16.2634 23.2590 31.0803 47.6242 54.1680 67.9151 78.5493 84.0297 85.3070 113.7924 132.9685 156.8059 187.5080 207.2311 213.4165 219.4675 229.2259 257.3104 268.4085 283.7989 303.6129 309.4276 317.1312 347.0204 380.0936 391.7319 397.4727 420.4818 437.9625 447.5747 471.6612 490.1886 518.7243 578.3706 631.0966 691.3188 734.6025 765.6679 773.0869 786.6918 795.5713 800.2477 810.5756 842.6842 900.5806 912.7320 924.4908 941.7370 941.9437 986.7727 988.3022 1000.0573 1045.4629 1049.4836 1057.5110 1062.3120 1074.8297 1081.7253 1084.7578 1094.3526 1106.1916 1114.0361 1138.6315 1143.3850 1155.7768 1173.8687 1179.6870 1197.0951 1204.3726 1210.6201 1222.9752 1258.8597 1272.6726 1282.7573 1287.1031 1292.4670 1295.9641 1315.9961 1320.0805 1334.3112 1338.3839 1350.7382 1360.5622 1361.7557 1364.3855 1371.7152 1377.7521 1386.4110 1387.4096 1394.2941 1395.0807 1411.0922 1456.0743 1457.0365 1459.8414 1460.9364 1462.4793 1463.8603 1465.6253 1467.0638 1471.0289 1473.7084 1474.4228 1479.7519 1483.7507 1486.9128 1489.3749 1490.5358 1633.5833 2845.1250 2847.9923 2853.7420 2856.3840 2871.3700 2876.0165 2975.8724 2979.3050 2982.4732 2983.0670 2986.7322 2990.7460 3021.9871 3027.0197 3033.1485 3036.8844 3041.5272 3046.1345 3061.4746 3074.4917 3075.8949 3081.8460 3091.3575 3091.6516 3091.8927 3093.6101 3096.2197 3103.7268 3117.2496
redmass: 3.6442 3.5898 3.5276 3.2840 2.8338 2.5753 2.4357 3.2983 2.8720 5.8686 3.2219 1.8439 1.8704 1.1575 1.6199 1.6615 1.8404 1.1559 2.4064 1.8516 2.4557 2.4580 2.4376 2.6801 4.0391 2.8419 2.5160 2.3899 2.6824 2.7526 2.7317 2.7335 3.7226 3.7132 2.3500 11.0723 3.0950 3.2521 2.4260 1.3680 1.1356 2.0219 1.9263 1.5587 2.5192 1.9293 1.2305 2.1104 1.4310 3.2444 2.3031 2.5768 2.0606 2.3536 1.7893 2.5789 1.9414 2.6567 2.1377 2.3118 1.7429 2.1141 2.4431 2.3917 2.0364 1.9447 1.9479 1.1451 2.1174 2.2165 1.7980 1.8217 1.3320 1.2987 1.2210 1.3976 1.1892 1.3638 1.3553 1.2581 1.3442 1.3270 1.3636 1.3578 1.3498 1.3991 1.2670 1.2354 1.2375 1.4395 1.2455 2.7708 1.0767 1.0540 1.0687 1.0736 1.0563 1.0868 1.0503 1.0876 1.0564 1.0512 1.0909 1.0549 1.0749 1.0688 1.0486 1.0747 9.7211 1.0721 1.0713 1.0717 1.0705 1.0701 1.0707 1.0687 1.0679 1.0357 1.0357 1.0356 1.0359 1.0869 1.0865 1.0871 1.0880 1.0872 1.0892 1.0914 1.0984 1.0979 1.0994 1.1003 1.1003 1.0987 1.0952 1.1004 1.1007 1.0930
irintensity: 0.0136 0.1951 0.0052 0.1516 0.5480 0.9013 0.8660 1.8382 0.5990 0.7052 1.6760 1.2472 3.1467 0.7441 3.4991 2.2693 2.6274 0.6695 1.6509 2.4533 6.2959 5.9960 2.6034 0.3611 6.1616 2.2127 4.8197 2.5162 1.8695 12.1085 0.3379 6.2377 4.0724 2.8939 0.6671 16.8302 8.7619 3.6728 16.2640 4.8095 5.5696 2.4243 21.9397 2.4347 12.2588 2.0339 2.1440 21.4711 2.2211 58.1785 2.4421 103.4657 40.8280 43.5709 5.3805 61.2275 14.6385 34.6586 4.9879 121.1433 99.0739 9.6687 81.2014 8.2661 10.6714 6.6835 86.4065 7.0654 66.8315 48.2754 213.0386 20.0300 21.0564 9.3739 19.1856 53.1443 4.7982 9.2578 13.5147 1.8617 6.1398 0.8262 0.5331 2.4293 8.8019 7.4784 36.4681 24.1999 21.9016 10.6340 20.0193 159.9476 0.1162 9.8416 6.7902 7.6094 7.3074 26.1028 5.1165 3.1418 2.0664 4.8838 1.0826 4.2444 12.9852 12.4208 22.1468 10.1522 440.6781 28.3202 53.7917 153.3256 19.0885 182.0474 131.6918 19.5827 70.6984 38.4344 28.5403 19.3806 25.6604 19.4637 6.3689 19.4851 6.7504 48.8087 38.1276 40.0760 38.1604 85.3028 5.4362 29.4067 54.4656 62.9077 7.1416 26.7099 26.1560 5.1461
temp: 298.150 k
press: 1.00000 atm
elementType: 8 8 7 7 7 6 6 6 6 6 6 6 6 6 6 6 6 6 6 1 1 1 1 1 1 1 1 1 1 1 1 1 1 1 1 1 1 1 1 1 1 1 1 1 1 1 1 1
symmnumber: 1
zpe: 1111124.7 jmol-1
zpe.correction: 0.423205 hartree
zpe.thermalcorrener: 0.445838 hartree
zpe.thermalcorrenthalpy: 0.446782 hartree
zpe.thermalcorrgfe: 0.368861 hartree
zpe.sumelectzpe: -864.010222 hartree
zpe.sumelectthermal: -863.987590 hartree
zpe.sumelectthermalent: -863.986646 hartree
zpe.sumelectthermalfe: -864.064566 hartree
dipole: 1.7366 2.1497 -1.4357
dipole: 3.1142
quadrupole: -115.9665 -117.2443 -119.9783
quadrupole: -7.8273 3.0470 1.7013
quadrupole: 1.7632 0.4854 -2.2486 -7.8273 3.0470 1.7013
hfenergy: -864.4334273 hartree
pointgroup: C01 [X(C14H29N3O2)]
dipole: -0.6717835 -0.9245662 0.441622 debye
polarizability: 238.5927383|0.6273865|155.9371229|4.5271995|-10.9070869|161.7180034 unknown
InChI: InChI=1S/C14H29N3O2/c1-5-15(6-2)7-8-16-9-11-17(12-10-16)14(18)19-13(3)4/h13H,5-12H2,1-4H3
charge 0 multiplicity 1
48 atoms
O  3.905552 -0.560642 0.213373
O  3.974275 1.580617 -0.769963
N  -0.848169 0.337332 -0.615351
N  2.014674 0.288922 -0.792028
N  -4.51978 -0.364012 0.183939
C  -0.085933 1.594375 -0.831015
C  -0.056669 -0.601604 0.219585
C  -2.215217 0.573677 -0.085833
C  1.24437 1.295925 -1.547891
C  1.278532 -0.948545 -0.468546
C  -3.183439 -0.580801 -0.427974
C  3.337949 0.526453 -0.483537
C  -5.636755 -0.878662 -0.652938
C  -4.582238 -0.840939 1.592783
C  -5.934199 0.018945 -1.869284
C  -5.653452 -0.115573 2.429641
C  5.360241 -0.419285 0.56258
C  6.212395 -0.782767 -0.662264
C  5.573985 -1.344628 1.763434
H  -0.690513 2.272055 -1.461104
H  0.129686 2.120529 0.133856
H  -0.63254 -1.532079 0.368939
H  0.156074 -0.163556 1.229295
H  -2.618414 1.493418 -0.546593
H  -2.207166 0.749913 1.019264
H  1.026046 0.90383 -2.561873
H  1.862098 2.203633 -1.639233
H  1.064067 -1.501711 -1.405738
H  1.903125 -1.576821 0.182283
H  -2.747031 -1.562451 -0.118626
H  -3.284247 -0.619233 -1.526316
H  -5.442722 -1.927788 -0.994367
H  -6.541044 -0.919647 -0.018687
H  -4.749698 -1.948047 1.640418
H  -3.593814 -0.656848 2.054248
H  -6.189371 1.039069 -1.533422
H  -5.065544 0.091787 -2.548642
H  -6.782125 -0.386843 -2.45242
H  -5.45716 0.97067 2.4363
H  -6.670124 -0.273835 2.026394
H  -5.646303 -0.48561 3.472111
H  5.527365 0.639557 0.834308
H  5.997996 -1.815662 -0.990687
H  6.007201 -0.088185 -1.493854
H  7.286922 -0.712738 -0.410711
H  5.358771 -2.393424 1.491431
H  4.915438 -1.058173 2.601276
H  6.623211 -1.282197 2.104736
