program: Gaussian 09
title: 000212375
version: EM64L-G09RevD.01
frameworkgroup: C1[X(C12H25N3O2)]
method: RPBEPBE
basis: SDD
operation: Freq
keyword: #p
keyword: freq=noraman
keyword: PBEPBE/SDD
title: #p freq=noraman PBEPBE/SDD
converged: YES YES NO NO
title: Mulliken charges:
elementType: O O N N N C C C C C C C C C C C C H H H H H H H H H H H H H H H H H H H H H H H H H
charge: -0.327980 -0.314572 -0.086554 -0.146793 -0.085297 -0.334441 -0.353810 -0.398760 -0.390662 -0.350621 -0.362284 0.310100 -0.619385 -0.614148 0.056282 -0.685551 -0.689721 0.208848 0.185240 0.188498 0.217268 0.252020 0.216082 0.220343 0.251354 0.184251 0.225540 0.228006 0.178310 0.184513 0.221950 0.229397 0.228447 0.221040 0.185639 0.232902 0.208716 0.256709 0.212726 0.207042 0.231478 0.217876
chargesum: 0.00000
title: Mulliken charges with hydrogens summed into heavy atoms:
elementType: O O N N N C C C C C C C C C C C C
charge: -0.327980 -0.314572 -0.086554 -0.146793 -0.085297 0.059647 0.051956 0.069342 0.081035 0.059170 0.044032 0.310100 0.016475 0.020978 0.289184 -0.007399 -0.033324
polarizability: 2.09869656e+02 -2.32150799e+00 1.44039892e+02 4.99713972e+00 2.62494533e+00 1.30397534e+02
1716.lowfreq: -3.1439 -1.7477 -0.0009 -0.0007 0.0003 9.0050 16.8642 23.0679 44.2039
frequency: 11.0778 21.4394 44.1411 51.1386 60.9451 87.9772 94.9345 112.9960 127.9648 176.4691 192.4589 205.7115 209.7712 223.4664 236.7783 240.8979 270.7580 290.1952 313.2100 325.6134 352.5097 372.1028 392.8544 405.1282 425.1724 448.0052 460.3137 474.8799 517.5704 581.2843 632.4683 690.4486 756.0564 772.1312 795.5881 804.0031 826.2668 842.7655 900.5636 925.4590 941.5088 944.0443 988.0295 1001.0983 1024.6696 1031.4385 1049.9593 1058.3324 1061.7452 1075.1453 1090.7249 1099.1663 1106.9845 1128.0914 1140.6796 1151.7625 1156.3022 1179.1460 1182.1405 1199.3116 1208.4862 1222.9062 1261.3618 1266.6013 1281.8076 1290.4530 1299.1402 1318.3403 1321.4242 1334.9707 1339.6629 1352.5761 1365.0671 1369.4735 1378.8026 1394.3217 1394.7266 1412.4363 1417.4177 1441.4552 1454.7442 1457.1090 1459.4844 1460.7355 1462.6919 1463.7998 1464.4046 1467.8065 1473.0792 1474.8168 1477.1015 1480.7479 1486.6149 1487.1223 1633.9180 2832.3682 2840.2130 2848.2274 2854.7303 2859.1734 2871.1160 2976.3299 2980.2616 2985.7888 2990.1421 3019.2339 3027.5634 3028.2601 3034.6133 3039.8284 3049.6398 3050.7215 3078.7866 3079.9799 3086.8463 3090.3685 3094.8743 3096.2730 3102.9083 3117.1018
redmass: 2.6307 3.6230 3.1579 2.9588 3.9775 3.8961 2.4023 5.3957 3.1395 2.9315 1.0691 2.2514 2.2132 1.1541 1.2193 1.2207 3.2472 2.2732 2.2636 2.5625 2.4607 3.4778 2.5649 2.4900 2.5556 2.7559 2.6603 2.7105 3.7720 3.7960 2.3251 11.1424 4.2717 4.6475 1.3162 2.8718 3.4572 1.6656 2.5231 1.2345 1.3563 2.3031 3.3149 2.5858 2.3454 1.5522 1.7369 1.9105 2.5053 2.2320 1.3858 2.2786 1.7492 1.8772 2.2042 2.4902 2.0514 1.9360 1.8535 1.1250 2.1748 1.7117 2.6119 2.0096 1.4857 1.4650 1.1903 1.4018 1.3594 1.2707 1.3054 1.3378 1.3583 1.4155 1.2653 1.2767 1.3959 2.7763 1.1475 1.1627 1.0831 1.0540 1.0761 1.0566 1.0866 1.0680 1.0570 1.0914 1.0508 1.0643 1.0713 1.0760 1.0652 1.0495 9.6958 1.0690 1.0577 1.0710 1.0696 1.0594 1.0692 1.0690 1.0677 1.0356 1.0359 1.0718 1.0865 1.0718 1.0854 1.0887 1.0895 1.0912 1.1010 1.0994 1.1004 1.0986 1.0952 1.1003 1.1005 1.0931
irintensity: 0.1649 0.0173 0.1296 0.0700 1.9553 1.9871 1.2301 1.1701 0.7376 2.8102 0.1967 4.6912 2.3360 0.6204 1.6658 2.0597 1.7312 6.5576 11.5894 1.6372 4.2893 9.8592 4.0821 2.0060 0.2343 8.2325 1.9299 0.2947 4.2174 2.9254 0.9915 16.5226 6.0360 10.8126 2.7372 13.7414 18.7935 6.6795 13.4022 2.2963 0.1537 25.1052 40.0737 76.7902 98.3922 16.6135 16.8990 12.6587 76.8218 16.2330 7.7779 128.8587 75.7396 12.7179 65.7267 6.7564 13.2735 79.0200 4.7847 8.5687 62.4895 209.5227 24.4550 17.4177 16.4851 35.1558 9.2151 12.5294 10.3119 2.4127 5.7790 1.6674 8.7366 3.3682 33.0731 27.0968 1.6507 158.2737 3.4409 2.1358 1.0188 5.7031 14.8084 16.4963 15.2788 22.2029 5.2138 3.5738 5.6467 6.6014 11.2070 8.6609 26.0277 18.6189 436.2507 90.7397 62.9298 45.3584 21.6476 255.9085 156.3615 25.6579 71.5778 16.2652 25.4994 44.3841 6.9992 52.8613 5.6202 32.2598 39.0016 50.9734 33.5956 5.6162 49.4605 66.2571 5.4228 24.9634 26.6750 5.1944
temp: 298.150 k
press: 1.00000 atm
elementType: 8 8 7 7 7 6 6 6 6 6 6 6 6 6 6 6 6 1 1 1 1 1 1 1 1 1 1 1 1 1 1 1 1 1 1 1 1 1 1 1 1 1
symmnumber: 1
zpe: 964158.7 jmol-1
zpe.correction: 0.367229 hartree
zpe.thermalcorrener: 0.387174 hartree
zpe.thermalcorrenthalpy: 0.388118 hartree
zpe.thermalcorrgfe: 0.316388 hartree
zpe.sumelectzpe: -785.562151 hartree
zpe.sumelectthermal: -785.542205 hartree
zpe.sumelectthermalent: -785.541261 hartree
zpe.sumelectthermalfe: -785.612991 hartree
dipole: -1.6550 -2.7873 -0.1042
dipole: 3.2433
quadrupole: -101.5193 -107.1235 -104.2102
quadrupole: -5.5793 -0.5532 -1.2506
quadrupole: 2.7650 -2.8391 0.0741 -5.5793 -0.5532 -1.2506
hfenergy: -785.9293792 hartree
pointgroup: C01 [X(C12H25N3O2)]
dipole: -0.673424 1.0837375 -0.0138369 debye
polarizability: 209.6128443|3.3747238|144.4065646|-6.1945287|1.6706322|130.2876726 unknown
InChI: InChI=1S/C12H25N3O2/c1-11(2)17-12(16)15-9-7-14(8-10-15)6-5-13(3)4/h11H,5-10H2,1-4H3
charge 0 multiplicity 1
42 atoms
O  3.23247 0.73227 0.205377
O  3.346715 -1.575685 -0.262362
N  -1.506841 -0.540637 0.178992
N  1.351029 -0.572831 0.458038
N  -5.226435 0.275054 -0.150295
C  -0.725074 0.721081 0.099821
C  -0.705948 -1.673492 -0.355366
C  0.583595 0.603851 0.907052
C  0.595621 -1.840184 0.450829
C  -2.839684 -0.443243 -0.469038
C  -3.846116 0.357049 0.385821
C  2.684001 -0.563394 0.104209
C  -5.416424 1.045711 -1.397095
C  -6.236289 0.635596 0.86672
C  4.6723 0.860769 -0.20535
C  4.755893 0.962971 -1.735269
C  5.188186 2.101299 0.528594
H  -1.325622 1.548515 0.51677
H  -0.476584 0.976938 -0.963083
H  -0.448121 -1.525996 -1.4355
H  -1.30358 -2.599458 -0.270653
H  1.201233 1.504512 0.781805
H  0.33141 0.486575 1.980818
H  0.341853 -2.120774 1.493006
H  1.23791 -2.622044 0.015077
H  -2.758969 -0.010109 -1.497846
H  -3.248638 -1.464256 -0.577738
H  -3.838862 -0.08815 1.397239
H  -3.514163 1.422994 0.493221
H  -5.246749 2.145819 -1.262551
H  -6.448573 0.902596 -1.763908
H  -4.728764 0.687199 -2.18125
H  -6.122922 -0.01512 1.751739
H  -7.249413 0.478401 0.454359
H  -6.166225 1.700693 1.207894
H  5.189887 -0.05431 0.137371
H  5.809288 1.081358 -2.05018
H  4.356883 0.04802 -2.204059
H  4.184219 1.836299 -2.097699
H  6.259157 2.254095 0.302484
H  5.073486 1.98682 1.62008
H  4.634161 3.002701 0.211022
