program: Gaussian 09
title: 000212363
version: EM64L-G09RevD.01
frameworkgroup: C1[X(C8H6N4O8)]
method: RPBEPBE
basis: SDD
operation: Freq
keyword: #pfreq=noraman
keyword: PBEPBE/SDD
title: #p freq=noraman PBEPBE/SDD
converged: NO YES NO NO
title: Mulliken charges:
elementType: O O O O O O O O N N N N C C C C C C C C H H H H H H
charge: -0.160645 -0.156853 -0.160667 -0.156884 -0.140819 -0.155548 -0.140826 -0.155596 0.138286 0.148899 0.138301 0.148853 0.512315 0.512227 -0.328631 -0.328565 -0.416805 -0.416753 -0.294771 -0.294660 0.312945 0.312992 0.248585 0.248583 0.293030 0.293007
chargesum: 0.00000
title: Mulliken charges with hydrogens summed into heavy atoms:
elementType: O O O O O O O O N N N N C C C C C C C C
charge: -0.160645 -0.156853 -0.160667 -0.156884 -0.140819 -0.155548 -0.140826 -0.155596 0.138286 0.148899 0.138301 0.148853 0.512315 0.512227 -0.015687 -0.015573 -0.168220 -0.168169 -0.001741 -0.001653
polarizability: 2.13728096e+02 -4.78493631e+00 1.16095032e+02 1.40361874e-02 1.57362070e-02 1.40570492e+02
1716.lowfreq: -14.8585 -14.5581 -0.0005 -0.0004 0.0001 3.6844 3.7710 9.1280 26.7734
frequency: -14.8164 -13.9045 26.7589 33.5686 43.0099 44.6989 81.5800 89.3259 97.4913 138.8027 156.4198 181.1499 209.2244 249.1309 290.4478 334.6034 340.4737 357.4485 380.5698 382.3023 405.9437 511.1502 521.9659 532.2417 540.2860 612.7917 639.7667 668.7461 692.5124 701.2813 740.4871 744.8119 745.6889 759.3325 797.1760 837.1342 843.1004 854.9565 866.6739 876.0543 877.3901 961.7988 988.7926 1016.1419 1137.1185 1152.3964 1153.2322 1193.2013 1197.6977 1211.1792 1212.9174 1217.2175 1223.4536 1223.9172 1279.0089 1285.3401 1343.2739 1390.2718 1418.9127 1441.9672 1442.2288 1454.5088 1457.2828 1502.9364 1578.2785 1617.7446 3129.2709 3130.0247 3135.5759 3155.7330 3177.9965 3194.6204
redmass: 15.8958 15.2940 13.3250 11.3866 15.6718 13.6895 4.4452 12.8560 12.7139 12.1168 11.5906 9.1804 8.2543 10.7862 12.6120 8.5345 5.8117 11.9283 10.0718 9.4619 2.8331 5.9122 11.5944 5.4395 8.8597 7.5135 8.5700 6.5884 4.3338 8.7181 12.7025 8.1101 10.2996 5.0102 5.4991 8.3414 1.3035 7.2835 4.4155 1.9197 5.1762 1.3946 1.3865 3.0128 1.4849 4.6165 4.5902 2.0721 1.8721 4.4930 4.0953 1.3108 1.6196 1.6031 1.9982 2.8416 1.2775 7.8115 2.4604 5.7258 5.6902 6.7385 5.7723 2.4206 6.5341 6.1072 1.0888 1.0888 1.0883 1.0976 1.0897 1.0972
irintensity: 0.3686 0.4453 0.0018 0.5735 0.0134 0.2832 0.0046 1.4289 0.0018 4.6894 14.8393 4.4552 1.3105 0.0081 0.7912 0.0986 1.7227 1.9806 3.3609 0.0618 0.0044 9.4249 1.1739 9.9927 4.4404 1.1602 3.8077 0.0223 78.8035 0.1777 60.1906 7.0690 13.0229 71.8284 0.0926 0.1732 10.8177 1.8315 18.2442 61.6256 0.0617 0.0124 0.0000 3.7701 4.6531 2.8807 261.2789 0.0008 2.0647 99.4128 43.2168 8.1002 1.0171 69.1315 167.7846 15.8943 8.1915 29.5893 6.1014 4.6903 41.5038 171.9678 254.1453 0.6987 2.8551 0.0312 0.5520 1.9572 3.0865 3.5516 0.1179 2.0981
temp: 298.150 k
press: 1.00000 atm
elementType: 8 8 8 8 8 8 8 8 7 7 7 7 6 6 6 6 6 6 6 6 1 1 1 1 1 1
symmnumber: 1
zpe: 414090.6 jmol-1
zpe.correction: 0.157719 hartree
zpe.thermalcorrener: 0.174361 hartree
zpe.thermalcorrenthalpy: 0.175305 hartree
zpe.thermalcorrgfe: 0.110308 hartree
zpe.sumelectzpe: -1127.413436 hartree
zpe.sumelectthermal: -1127.396794 hartree
zpe.sumelectthermalent: -1127.395850 hartree
zpe.sumelectthermalfe: -1127.460848 hartree
dipole: 0.0006 0.0000 4.6188
dipole: 4.6188
quadrupole: -145.0223 -131.0720 -107.9350
quadrupole: 0.2010 -0.0100 0.0021
quadrupole: -17.0126 -3.0622 20.0748 0.2010 -0.0100 0.0021
hfenergy: -1127.5711552 hartree
pointgroup: C01 [X(C8H6N4O8)]
dipole: 0.0002521 0.0000169 -1.8171856 debye
dipolederiv: -0.7643088 0.1935627 -0.2082943 0.3249211 -0.3703782 -0.0214261 -0.1869949 -0.0931045 -0.352156 -0.2354164 -0.2291483 -0.1084649 -0.3629377 -0.6367084 -0.1607782 -0.0716429 -0.0831945 -0.4829885 -0.7632978 0.1930443 0.2079135 0.3259655 -0.3708311 0.021141 0.1881194 0.0929358 -0.3522467 -0.2356787 -0.2292547 0.1086509 -0.3630998 -0.6365192 0.1608223 0.0718981 0.0834968 -0.4832229 -0.5270279 0.0994332 -0.0850564 0.10182 -0.377691 -0.2253627 -0.2449827 -0.2328068 -0.4089247 -0.2483293 -0.1268098 0.0183506 -0.2177989 -0.4143172 0.0814368 0.0273616 0.0334232 -0.6526484 -0.526956 0.0994408 0.0855733 0.1021002 -0.3780903 0.2257344 0.2448971 0.2319912 -0.4090071 -0.2484877 -0.126935 -0.0183469 -0.2179089 -0.4144739 -0.081511 -0.0272935 -0.0334719 -0.6527414 1.0005218 -0.4738662 0.335781 -0.5495174 0.8064555 0.3174703 0.4828869 0.54655 0.5910274 0.1269184 0.5238637 0.0966815 0.7446809 1.2303552 -0.0032603 0.0588873 -0.1584676 1.0315832 0.9995795 -0.4735957 -0.3358592 -0.5501696 0.8070853 -0.3175074 -0.484102 -0.5458282 0.5913465 0.1272647 0.5241306 -0.0969837 0.7450381 1.2303192 0.0032079 -0.059165 0.1577293 1.0317289 -0.007756 0.033122 -0.0734106 0.0078812 -0.1450273 0.0061067 0.0681166 0.0001523 0.0368281 -0.0080963 0.0331815 0.073385 0.0077977 -0.1451334 -0.0060373 -0.0680724 0.0000661 0.0368042 0.5871876 -0.0047829 0.0024985 0.0055857 -0.2463632 -0.020332 -0.0345794 -0.0190659 0.1085497 0.5873075 -0.0047051 -0.0024278 0.0046551 -0.246023 0.0203611 0.0345543 0.0196254 0.1084332 -0.0604193 -0.0045892 0.2000886 0.0024025 -0.0916456 0.015994 -0.0546601 -0.0137056 0.0225299 -0.0602919 -0.0046701 -0.2000541 0.0026868 -0.0916627 -0.0159097 0.0548551 0.013736 0.0225474 -0.0353524 -0.0161503 -0.1925558 -0.0315882 -0.0384446 0.0060697 -0.0794184 -0.0121103 -0.0184122 -0.0351045 -0.0161021 0.1925574 -0.0314558 -0.0383876 -0.0060419 0.079306 0.0121076 -0.0183697 0.0399958 0.0135948 0.0084647 -0.0028904 0.0144767 0.0061741 0.0106072 -0.0029068 0.042882 0.0400186 0.0136172 -0.0084969 -0.0029213 0.0144038 -0.0062309 -0.0105824 0.0029581 0.0429588 0.0189626 -0.0083751 -0.0918079 -0.0083515 0.1421183 -0.0063636 -0.0695773 -0.0013348 0.0101296 0.0189658 -0.0083308 0.0918133 -0.0082636 0.1421096 0.0062837 0.0695763 0.0012476 0.0101247 0.1049361 0.0001733 0.0430461 -0.0143209 0.1271964 0.0028332 0.0501939 0.0124541 0.0716216 0.1048646 0.0001512 -0.0430458 -0.0143107 0.1271767 -0.0028741 -0.0501888 -0.0124767 0.0716225 unknown
polarizability: 212.8640796|10.3201558|116.959048|-0.0149119|0.014909|140.5704924 unknown
InChI: InChI=1S/C8H6N4O8/c13-9(14)7(10(15)16)5-1-2-6(4-3-5)8(11(17)18)12(19)20/h1-4,7-8H
charge 0 multiplicity 1
26 atoms
O  -4.779009 1.335428 -0.423161
O  -3.899301 -2.371016 -0.52778
O  4.778051 -1.336863 -0.42377
O  3.899691 2.370791 -0.529314
O  -3.143406 1.614365 1.150214
O  -3.372929 -1.467267 1.507751
O  3.142552 -1.61471 1.149921
O  3.373138 1.468416 1.506783
N  -3.663155 1.037698 0.138216
N  -3.449264 -1.444767 0.23125
N  3.663271 -1.037373 0.138804
N  3.449394 1.44514 0.230291
C  -1.410087 -0.082343 -0.447782
C  1.410186 0.082301 -0.44785
C  -2.909161 -0.173686 -0.507051
C  2.909261 0.173607 -0.507202
C  -0.7028 -0.043229 -1.675418
C  0.702883 0.042415 -1.675453
C  -0.702182 -0.039981 0.78161
C  0.702297 0.040699 0.781578
H  -3.307587 -0.247671 -1.527881
H  3.307662 0.246952 -1.528087
H  -1.244425 -0.077833 -2.627204
H  1.244498 0.076421 -2.627266
H  -1.247155 -0.07119 1.727979
H  1.247279 0.072493 1.727921
