program: Gaussian 09
title: 000212353
version: EM64L-G09RevD.01
frameworkgroup: C1[X(C13H21NO2)]
method: RPBEPBE
basis: SDD
operation: Freq
keyword: #p
keyword: freq=noraman
keyword: PBEPBE/SDD
title: #p freq=noraman PBEPBE/SDD
converged: YES YES NO NO
title: Mulliken charges:
elementType: O O N C C C C C C C C C C C C C H H H H H H H H H H H H H H H H H H H H H
charge: -0.470278 -0.269903 -0.100631 -0.495049 -0.181809 -0.359563 0.452283 -0.408044 -0.394399 -0.610974 -0.620167 -0.382710 -0.353085 0.333244 -0.242012 -0.686904 0.235339 0.194985 0.224551 0.239288 0.190321 0.262049 0.265056 0.231575 0.190721 0.219964 0.223024 0.190135 0.226260 0.331235 0.246423 0.240006 0.204556 0.207314 0.205169 0.231700 0.230331
chargesum: 0.00000
title: Mulliken charges with hydrogens summed into heavy atoms:
elementType: O O N C C C C C C C C C C C C C
charge: -0.139043 -0.269903 -0.100631 -0.064726 0.042741 0.070046 0.452283 -0.145995 -0.129343 0.031287 0.019252 -0.136287 -0.113079 0.333244 0.169857 -0.019704
polarizability: 2.15196802e+02 9.11085070e+00 1.49582613e+02 -8.72828138e+00 1.23626548e+01 1.08721935e+02
1716.lowfreq: -4.6211 -0.0007 -0.0001 0.0004 6.1053 9.6761 28.5340 32.0024 45.7281
frequency: 28.2233 31.8622 45.7034 57.5844 94.4420 96.9369 116.4398 121.4938 173.7587 214.1484 217.7095 237.4347 243.3212 261.6777 285.8198 298.7857 306.2434 336.6627 361.0194 381.5264 414.6529 420.8242 431.2688 479.7675 536.7780 569.9927 575.5745 628.8478 703.4144 731.8817 762.4050 783.5233 812.1676 835.7384 840.5427 859.0898 903.0661 942.8468 957.8974 973.1144 978.2002 1005.2723 1030.0522 1033.8864 1039.9001 1048.5525 1083.4699 1096.6693 1112.0289 1118.3970 1133.8086 1137.0237 1145.2433 1157.6799 1177.4787 1214.3630 1221.3049 1230.5135 1261.8736 1262.6159 1265.4247 1290.2500 1306.6325 1339.7131 1363.2525 1367.8009 1377.6873 1397.2547 1403.2030 1416.7689 1421.4412 1440.0844 1453.4997 1460.5540 1462.6251 1467.3533 1474.3754 1476.9580 1477.5623 1486.6222 1488.2037 1504.9091 1585.0465 1623.8760 2833.8710 2848.6113 2865.3017 2950.3616 2964.6570 2981.3576 2995.6029 3007.6668 3017.0318 3024.1254 3027.0229 3042.5123 3075.7208 3080.7759 3092.8808 3104.3035 3124.7956 3146.7834 3160.6590 3168.3872 3557.8466
redmass: 3.4500 3.7678 3.1931 2.8650 3.9578 3.6992 1.7726 3.9592 2.9887 3.4682 1.3547 1.1484 1.2009 1.8322 2.1691 2.4214 2.0308 3.3473 2.0325 3.6796 3.0134 2.2878 3.4704 4.2701 2.7514 3.5698 3.2634 6.8365 2.8866 3.6035 3.4965 3.7856 1.2424 1.1577 1.5228 2.1374 3.2221 1.8564 1.6418 1.3601 5.1635 2.7575 1.7138 1.6487 2.8158 2.1386 1.5734 1.7776 1.6065 1.7393 1.4122 1.4408 1.5126 1.4799 1.2565 1.9593 2.0004 1.7742 1.1411 1.9267 1.8683 1.1899 1.3139 1.4504 1.6554 1.3769 2.0551 1.3060 2.1788 1.3974 1.8046 1.1669 1.0792 1.0403 1.0569 1.0944 1.0663 1.0779 1.0539 1.0554 1.1652 2.1557 7.1981 6.3739 1.0707 1.0568 1.0572 1.0553 1.0645 1.0844 1.0361 1.1074 1.0729 1.0795 1.0799 1.0961 1.1012 1.1005 1.0989 1.1013 1.0895 1.0871 1.0949 1.0959 1.0658
irintensity: 2.0349 0.4183 0.3359 1.1470 0.1077 0.3107 2.6123 3.0039 0.2325 1.5832 0.8546 0.5910 0.3214 59.0220 42.7147 36.0099 9.6774 5.8576 10.7495 2.1287 0.8471 0.8724 3.0467 0.5447 25.6247 27.2943 4.8906 0.3010 17.1452 2.6677 5.2327 3.0245 29.7604 2.5100 66.9681 25.0024 39.0267 16.8353 3.2639 0.3349 63.1561 9.1738 12.9619 17.4953 53.4855 32.1660 3.6983 5.3310 1.1900 11.2985 13.6586 4.3612 4.6434 90.1691 87.8490 126.2288 81.6593 29.9366 0.1312 13.8222 3.0527 2.0085 1.5259 2.6366 4.5917 23.4742 25.4926 40.2195 3.0754 0.8504 10.5048 5.5590 13.5740 11.5585 12.5594 8.4160 14.6333 29.6998 11.7106 14.4612 42.1132 86.2572 12.1574 50.7632 64.1297 74.2526 266.7307 41.5809 58.6310 22.6294 28.5789 38.6121 34.3887 23.3136 30.2248 56.0497 28.8856 50.3385 30.8375 36.2542 6.2092 11.1122 10.4871 7.7852 6.3132
temp: 298.150 k
press: 1.00000 atm
elementType: 8 8 7 6 6 6 6 6 6 6 6 6 6 6 6 6 1 1 1 1 1 1 1 1 1 1 1 1 1 1 1 1 1 1 1 1 1
symmnumber: 1
zpe: 831308.3 jmol-1
zpe.correction: 0.316629 hartree
zpe.thermalcorrener: 0.334519 hartree
zpe.thermalcorrenthalpy: 0.335463 hartree
zpe.thermalcorrgfe: 0.269710 hartree
zpe.sumelectzpe: -711.886703 hartree
zpe.sumelectthermal: -711.868813 hartree
zpe.sumelectthermalent: -711.867869 hartree
zpe.sumelectthermalfe: -711.933622 hartree
dipole: 1.4427 -0.3507 1.7931
dipole: 2.3280
quadrupole: -73.4465 -97.6079 -99.9792
quadrupole: -1.8178 -3.8182 3.5061
quadrupole: 16.8981 -7.2634 -9.6347 -1.8178 -3.8182 3.5061
hfenergy: -712.2033317 hartree
pointgroup: C01 [X(C13H21N1O2)]
dipole: 0.593312 0.2992101 -0.6303582 debye
polarizability: 214.2119439|-13.1948798|141.4587032|9.5049853|20.2340927|117.8307026 unknown
InChI: InChI=1S/C13H21NO2/c1-4-16-12-7-5-11(6-8-12)13(15)9-10-14(2)3/h5-8,13,15H,4,9-10H2,1-3H3
charge 0 multiplicity 1
37 atoms
O  1.612738 -2.821711 -0.28494
O  -3.534908 0.952096 0.182644
N  3.440432 1.167952 0.313106
C  2.608992 -0.728226 -1.154116
C  1.739996 -1.365955 -0.034817
C  2.836695 0.788436 -0.990854
C  0.330198 -0.799346 0.019615
C  0.041492 0.322984 0.839471
C  -0.709491 -1.352712 -0.761474
C  3.371707 2.628284 0.532779
C  4.813223 0.654881 0.493153
C  -1.248523 0.885211 0.869002
C  -2.012112 -0.804234 -0.739194
C  -2.281339 0.322874 0.077527
C  -4.651208 0.389374 -0.599403
C  -5.878641 1.245201 -0.296723
H  2.111666 -0.906075 -2.127267
H  3.584972 -1.256984 -1.192011
H  2.240829 -1.190294 0.938892
H  1.859055 1.3003 -1.062166
H  3.460697 1.152072 -1.849629
H  0.84094 0.753601 1.454947
H  -0.497686 -2.239446 -1.366806
H  2.319922 2.962406 0.479293
H  3.959122 3.217071 -0.217222
H  3.760722 2.87327 1.537527
H  5.193416 0.963443 1.483364
H  5.52746 1.028323 -0.285094
H  4.822645 -0.44835 0.461554
H  2.520934 -3.199233 -0.404951
H  -1.482341 1.747392 1.501362
H  -2.797937 -1.262925 -1.346989
H  -4.398219 0.41658 -1.679834
H  -4.814759 -0.667661 -0.303244
H  -6.753849 0.868526 -0.856951
H  -6.114019 1.218782 0.780953
H  -5.701821 2.295091 -0.586704
