program: Gaussian 09
title: 000212345
version: EM64L-G09RevD.01
frameworkgroup: C1[X(C17H28N2O4)]
method: RPBEPBE
basis: SDD
operation: Freq
keyword: #p
keyword: freq=noraman
keyword: PBEPBE/SDD
title: #p freq=noraman PBEPBE/SDD
converged: NO YES NO NO
title: Mulliken charges:
elementType: O O O O N N C C C C C C C C C C C C C C C C C H H H H H H H H H H H H H H H H H H H H H H H H H H H H
charge: -0.279965 -0.180901 -0.246291 -0.278664 -0.255138 -0.096081 -0.058481 -0.042629 0.435590 -0.596422 -0.465843 -0.512108 -0.467527 -0.468377 -0.412824 -0.394694 -0.493095 0.240124 0.320649 -0.282423 -0.355003 -0.616451 -0.616316 0.242640 0.202237 0.221068 0.222846 0.198586 0.238429 0.227645 0.219855 0.198430 0.204968 0.203042 0.201805 0.201019 0.204109 0.192798 0.201079 0.262493 0.261810 0.241303 0.234087 0.212803 0.232794 0.223450 0.191970 0.230732 0.225453 0.230969 0.194450
chargesum: 0.00000
title: Mulliken charges with hydrogens summed into heavy atoms:
elementType: O O O O N N C C C C C C C C C C C C C C C C C
charge: -0.279965 -0.180901 -0.246291 -0.278664 -0.255138 -0.096081 0.184159 0.159607 0.435590 -0.152507 -0.028828 -0.064607 -0.064129 -0.063529 -0.007697 -0.000817 0.031207 0.240124 0.320649 0.192968 0.090594 0.029701 0.034557
polarizability: 2.75343625e+02 -7.09867364e+00 1.82423084e+02 1.83098829e+00 3.89693049e+00 1.65799994e+02
1716.lowfreq: -28.8983 -9.7659 -6.9653 -0.0007 0.0007 0.0009 5.5254 17.6786 21.1548
frequency: -8.3991 16.5225 20.3743 42.2554 45.8275 66.0699 74.2279 88.2891 121.6371 139.3258 148.7388 186.1171 187.0341 190.7980 216.4888 235.4858 254.5368 266.7228 276.9538 294.9113 323.4255 339.6935 345.5903 351.1781 354.5345 373.5255 399.0840 419.3885 423.7908 442.9354 467.9199 485.2288 509.0665 561.1285 584.4646 615.6878 646.7811 682.8801 698.5826 708.9158 737.8557 748.0570 774.6791 800.2105 813.7628 816.1454 826.5386 837.3856 855.8956 883.6050 900.1904 902.0523 938.6352 955.9615 957.2362 982.1746 983.7199 992.0018 1017.0008 1031.6472 1038.8229 1051.2357 1062.4028 1072.3764 1080.5323 1090.2425 1090.8722 1102.6497 1110.3301 1116.8270 1121.7903 1137.9310 1138.8546 1149.0822 1165.7227 1174.0959 1186.2264 1187.8913 1229.0705 1241.4600 1252.1482 1260.4284 1263.0387 1273.1385 1277.1634 1288.9285 1297.2616 1300.6370 1309.3108 1321.9292 1328.1190 1336.1840 1337.9908 1339.2779 1343.6852 1346.5274 1352.5610 1357.1048 1369.3850 1371.5663 1379.2819 1422.3503 1441.4905 1447.1087 1452.4251 1460.7828 1461.4618 1463.4750 1464.3706 1470.2894 1470.7406 1472.9431 1474.8071 1479.7112 1481.1132 1485.3097 1487.7141 1609.1669 1721.1816 2859.1169 2868.1205 2895.0908 2952.1712 2962.5360 2962.9192 2965.8824 2968.0454 2976.5659 2981.2569 2988.1547 2992.0583 3002.5233 3016.9871 3019.8982 3020.6139 3027.2481 3027.4431 3033.7471 3036.1714 3040.2068 3043.0488 3049.6850 3054.7761 3080.1367 3086.9486 3089.9353 3135.2742
redmass: 3.2018 4.0468 3.9090 4.1014 4.1723 5.4288 6.7500 2.7622 4.1049 3.6449 3.7276 2.8815 2.7071 3.3603 1.1784 1.7295 2.0905 2.4515 2.7272 3.1050 2.3991 3.5672 1.8937 2.8096 2.3576 3.0715 2.9292 2.5977 3.1700 2.6451 2.9595 3.7397 4.5317 2.6187 3.0471 2.8566 4.5251 10.1131 4.9296 9.4319 4.7844 2.1600 2.6400 1.6195 1.5555 3.0264 2.7329 2.8791 2.8786 2.0236 1.9278 5.4976 2.2732 2.5446 1.7891 3.1476 2.0446 1.9602 1.9026 2.3345 1.5681 1.8207 1.8549 2.3967 1.4236 1.4778 1.3661 2.0790 1.3483 3.1172 1.7788 2.6299 1.5881 1.9838 2.9721 1.9511 1.5227 1.5500 1.4411 1.3377 1.4309 1.5830 1.3321 2.3572 1.8603 1.3638 1.3619 1.2310 1.9142 1.3963 1.5716 1.7844 1.5255 1.4557 1.5980 1.4326 1.5676 1.6501 1.5080 1.4349 1.4149 1.1400 1.1386 1.0866 1.1163 1.0869 1.0511 1.0889 1.0882 1.0579 1.0832 1.0897 1.0591 1.0924 1.0831 1.0808 1.0544 9.9098 12.7937 1.0562 1.0574 1.0690 1.0783 1.0615 1.0633 1.0652 1.0638 1.0610 1.0610 1.0770 1.0685 1.0652 1.0986 1.0985 1.0737 1.0737 1.0976 1.0998 1.1016 1.1020 1.0638 1.1020 1.0864 1.1005 1.1007 1.1001 1.1074
irintensity: 0.7628 0.1426 0.2239 0.7837 0.0420 1.0930 4.3070 0.6288 0.7040 1.8762 0.6318 0.7941 2.5376 0.1441 1.5485 0.1022 2.5797 3.9713 3.1205 17.0129 2.9125 0.2850 0.4112 18.7025 5.1939 0.1789 0.5915 6.2675 1.3705 1.5121 1.7658 4.5863 8.9391 0.8875 3.5011 19.7255 5.3384 0.9908 22.8085 24.4209 7.7214 3.3962 0.6797 4.2471 9.3535 11.5385 4.7583 2.9339 44.0115 2.7058 2.4329 9.9790 1.2131 232.5294 11.6498 298.9883 72.4600 18.9425 46.6480 63.8261 22.1831 0.2451 9.3519 34.1178 0.5023 7.3152 11.3654 9.5226 0.5289 14.4943 7.9640 46.3877 8.3681 33.2836 104.4080 19.1011 33.8976 32.2482 3.5016 2.3927 2.3386 4.9700 2.9815 10.3624 56.8302 41.8320 41.7487 0.3419 287.9213 22.3617 1.0939 192.4507 7.2172 19.7849 32.8916 0.2643 62.0623 12.2588 6.1759 11.0912 88.8041 2.7717 0.5425 7.9761 25.7790 8.2170 19.1362 9.8115 3.3410 6.2294 9.5019 16.1454 31.4777 9.0116 15.1164 15.3149 10.0891 254.8105 456.1324 72.9535 154.4108 101.2950 12.7202 68.4542 11.6978 27.7995 18.1492 18.4389 30.1698 39.1993 31.2659 22.5413 96.8056 19.3403 42.7192 43.8441 54.8203 38.0429 54.6448 72.5237 31.4029 47.5277 12.7114 28.5804 45.0312 9.9618 11.7326
temp: 298.150 k
press: 1.00000 atm
elementType: 8 8 8 8 7 7 6 6 6 6 6 6 6 6 6 6 6 6 6 6 6 6 6 1 1 1 1 1 1 1 1 1 1 1 1 1 1 1 1 1 1 1 1 1 1 1 1 1 1 1 1
symmnumber: 1
zpe: 1145531.8 jmol-1
zpe.correction: 0.436310 hartree
zpe.thermalcorrener: 0.458580 hartree
zpe.thermalcorrenthalpy: 0.459524 hartree
zpe.thermalcorrgfe: 0.383428 hartree
zpe.sumelectzpe: -1073.206960 hartree
zpe.sumelectthermal: -1073.184691 hartree
zpe.sumelectthermalent: -1073.183746 hartree
zpe.sumelectthermalfe: -1073.259842 hartree
dipole: 1.8205 -3.0563 -0.3064
dipole: 3.5706
quadrupole: -116.3773 -150.8446 -137.0964
quadrupole: 0.9134 -5.5570 -4.6232
quadrupole: 18.3955 -16.0718 -2.3236 0.9134 -5.5570 -4.6232
hfenergy: -1073.6432704 hartree
pointgroup: C01 [X(C17H28N2O4)]
dipole: -0.6967618 -0.7955003 0.9247427 debye
polarizability: 274.8151128|10.1185598|170.895301|-2.5228261|-8.3928973|177.8562894 unknown
InChI: InChI=1S/C17H28N2O4/c1-18(2)9-10-22-15(20)19-12-17(23-16(19)21)8-7-13-5-3-4-6-14(13)11-17/h13-14H,3-12H2,1-2H3
charge 0 multiplicity 1
51 atoms
O  -0.962109 0.408343 -1.385029
O  1.082496 1.159673 -2.216647
O  3.015835 0.929499 -0.182885
O  2.443979 -0.585593 1.51939
N  0.873212 0.073195 -0.070279
N  6.645803 -0.103138 0.059382
C  -3.809224 -0.567496 -1.049337
C  -4.394359 0.646137 -0.261973
C  -1.486049 -0.102983 -0.049566
C  -2.557064 -1.159973 -0.349468
C  -3.293227 1.705235 -0.00048
C  -2.060908 1.107665 0.715579
C  -4.899363 -1.643069 -1.297422
C  -5.119238 0.197577 1.035562
C  -5.635361 -2.07473 -0.004792
C  -6.21838 -0.850196 0.74018
C  -0.205598 -0.677315 0.610948
C  0.430511 0.621145 -1.315213
C  2.160226 0.084028 0.492069
C  4.429956 0.950921 0.301028
C  5.259961 -0.102056 -0.457069
C  7.668002 -0.388291 -0.966019
C  6.816574 -0.932825 1.270037
H  -3.465518 -0.188861 -2.033608
H  -5.164495 1.112743 -0.913432
H  -2.832355 -1.639266 0.611336
H  -2.115362 -1.948857 -0.988492
H  -3.702894 2.535942 0.606636
H  -2.964204 2.136479 -0.965198
H  -1.272728 1.875925 0.835476
H  -2.334724 0.766527 1.733925
H  -4.451238 -2.525658 -1.796742
H  -5.646491 -1.226533 -2.004079
H  -5.560949 1.084886 1.531462
H  -4.395787 -0.23529 1.75677
H  -4.940123 -2.616544 0.669026
H  -6.4431 -2.788426 -0.258019
H  -7.00591 -0.384219 0.111864
H  -6.707139 -1.169915 1.681012
H  -0.169466 -0.500238 1.697084
H  -0.096383 -1.762577 0.427181
H  4.781309 1.96719 0.072288
H  4.440989 0.772738 1.389682
H  4.767459 -1.100231 -0.366147
H  5.269624 0.162489 -1.529052
H  8.674157 -0.246421 -0.531174
H  7.615988 -1.429486 -1.37346
H  7.560736 0.31679 -1.808828
H  7.813183 -0.7487 1.709805
H  6.057866 -0.669905 2.026867
H  6.723975 -2.028737 1.062728
