program: Gaussian 09
title: 000212337
version: EM64L-G09RevD.01
frameworkgroup: C1[X(C14H24N2O4)]
method: RPBEPBE
basis: SDD
operation: Freq
keyword: #p
keyword: freq=noraman
keyword: PBEPBE/SDD
title: #p freq=noraman PBEPBE/SDD
converged: YES YES NO NO
title: Mulliken charges:
elementType: O O O O N N C C C C C C C C C C C C C C H H H H H H H H H H H H H H H H H H H H H H H H
charge: -0.280798 -0.179450 -0.290454 -0.234551 -0.253888 -0.094989 0.433536 -0.495782 -0.512212 0.013785 -0.422839 -0.429111 -0.471468 -0.745285 0.246724 0.339467 -0.315161 -0.305167 -0.607139 -0.633231 0.202991 0.228245 0.220380 0.203296 0.190693 0.227356 0.197887 0.197423 0.226686 0.256801 0.256333 0.216600 0.213933 0.213107 0.250292 0.222489 0.181075 0.217116 0.226495 0.218974 0.190649 0.272956 0.223087 0.183151
chargesum: 0.00000
title: Mulliken charges with hydrogens summed into heavy atoms:
elementType: O O O O N N C C C C C C C C C C C C C C
charge: -0.280798 -0.179450 -0.290454 -0.234551 -0.253888 -0.094989 0.433536 -0.064545 -0.088535 0.204478 0.002405 -0.005002 0.041666 -0.101646 0.246724 0.339467 0.157620 0.093023 0.028979 0.045962
polarizability: 2.16504852e+02 5.96303714e+00 1.56315223e+02 -1.70483480e+00 7.79367332e+00 1.56780112e+02
1716.lowfreq: -13.9843 -4.4263 -0.0006 -0.0001 0.0005 5.7460 13.1686 23.7430 42.5694
frequency: 12.5911 23.5864 42.5222 54.6347 62.7366 83.8730 93.0836 107.1277 154.4507 181.3395 198.7670 209.9559 212.6416 215.6624 230.7975 246.1746 260.5700 265.1607 300.0664 304.4195 317.3998 344.0357 363.5682 396.1403 420.1474 423.9781 426.0167 454.6378 483.1945 525.1228 544.7381 564.4020 646.2956 670.3954 688.4996 708.2262 745.2634 754.1815 765.9002 773.4639 795.8142 832.4480 869.8394 900.1224 928.6153 931.0046 943.7009 945.3496 953.5664 979.9043 999.8723 1024.9880 1034.9264 1038.8299 1061.4351 1076.9010 1087.5956 1092.7778 1097.3097 1102.7097 1131.7591 1136.8827 1152.2097 1161.9064 1170.4847 1177.0918 1192.0755 1210.6703 1247.3602 1248.5227 1267.3676 1269.6148 1276.4231 1281.3560 1298.3308 1308.1665 1309.0388 1330.3040 1346.2115 1349.1934 1353.1470 1363.5261 1369.2174 1370.9456 1389.8519 1419.9144 1438.0679 1443.0057 1453.7615 1454.6420 1455.8920 1459.0150 1467.0303 1469.4511 1469.5373 1476.7013 1477.5212 1484.2724 1484.5058 1489.3180 1649.9914 1740.3048 2815.3538 2854.6788 2868.9030 2933.9894 2966.6651 2969.1996 2972.9967 2984.2466 2988.0222 3005.5086 3018.7310 3025.0512 3033.6244 3035.3247 3039.2214 3041.6064 3045.7500 3050.0820 3065.5680 3067.4287 3078.3632 3092.7484 3095.7920 3104.4057
redmass: 4.1401 3.9099 3.9056 3.3667 3.7860 3.9573 5.2588 4.0448 4.0744 2.6275 1.5247 1.8358 1.6365 2.9965 1.3309 1.8788 3.3589 2.6077 3.2824 2.2791 3.3682 2.3332 2.0858 2.6155 2.0175 2.2770 2.6268 4.7844 3.4281 3.4939 3.0809 3.9875 3.6931 9.0142 6.1054 10.2868 4.2672 3.8070 3.2849 1.6142 3.7648 3.2099 2.4991 2.0527 1.5283 2.4980 2.1057 1.9048 1.8632 1.5588 3.7816 3.2880 1.6129 1.5556 1.8233 1.9144 1.8840 1.4836 1.3167 3.9167 2.6211 1.4857 1.7334 2.7563 2.6949 2.5867 1.9008 1.5744 1.4611 1.4287 1.4000 2.0937 1.7579 1.6131 1.8747 1.2834 1.3554 1.5860 1.4731 1.7796 1.5537 1.4294 1.5749 1.3908 1.2189 1.1413 1.1257 1.0856 1.0936 1.0954 1.0844 1.0727 1.0976 1.0739 1.0745 1.0515 1.0571 1.0558 1.0769 1.0493 10.8648 12.4440 1.0703 1.0564 1.0564 1.0827 1.0624 1.0359 1.0624 1.0601 1.0614 1.0654 1.0729 1.0825 1.0977 1.0624 1.0983 1.0744 1.1030 1.1028 1.0993 1.0993 1.1010 1.0999 1.1012 1.1068
irintensity: 0.8960 0.2267 1.7044 0.8787 0.5490 1.3916 1.1005 0.4122 0.5082 1.4937 0.6648 0.5396 0.2507 1.1545 1.2144 0.4755 0.6252 0.0901 3.7837 0.3601 3.3291 16.2722 7.6492 6.3946 0.2986 5.5457 0.7386 0.4490 0.4053 7.2738 4.2328 1.8846 5.6554 3.8107 30.5254 36.2295 0.9292 11.4725 6.9478 0.4442 19.6018 6.0772 29.0679 18.5452 10.8625 172.3820 53.6200 17.8568 11.2487 26.8635 359.5883 5.2018 5.0659 16.4853 18.6374 33.4029 1.5195 5.9825 1.7600 54.5614 48.8584 6.2946 6.8340 59.2955 31.7858 99.8987 9.4576 17.9054 40.6256 2.5921 28.2276 255.6624 13.0866 0.5784 161.9638 7.4516 1.2722 10.6157 2.9959 27.5760 32.4314 77.1616 12.2814 6.5861 9.6568 3.1230 3.7585 7.8698 12.9414 14.4868 5.1970 8.8981 34.6329 27.9706 7.2880 14.7324 9.9823 11.8452 13.2575 24.8613 173.8089 561.0924 104.4013 74.7239 265.9914 26.8855 5.8068 38.1688 42.2768 41.8691 30.2317 24.0016 37.3360 22.5075 47.6544 52.1958 11.2543 16.8410 0.7736 44.6228 72.9493 44.4652 30.9696 11.8563 22.3176 9.4052
temp: 298.150 k
press: 1.00000 atm
elementType: 8 8 8 8 7 7 6 6 6 6 6 6 6 6 6 6 6 6 6 6 1 1 1 1 1 1 1 1 1 1 1 1 1 1 1 1 1 1 1 1 1 1 1 1
symmnumber: 1
zpe: 975981.3 jmol-1
zpe.correction: 0.371732 hartree
zpe.thermalcorrener: 0.392750 hartree
zpe.thermalcorrenthalpy: 0.393695 hartree
zpe.thermalcorrgfe: 0.320228 hartree
zpe.sumelectzpe: -956.711198 hartree
zpe.sumelectthermal: -956.690180 hartree
zpe.sumelectthermalent: -956.689235 hartree
zpe.sumelectthermalfe: -956.762702 hartree
dipole: -0.4188 5.5402 5.0455
dipole: 7.5051
quadrupole: -104.7251 -129.1747 -122.5806
quadrupole: -2.9625 -1.4738 -10.7536
quadrupole: 14.1017 -10.3479 -3.7538 -2.9625 -1.4738 -10.7536
hfenergy: -957.0829299 hartree
pointgroup: C01 [X(C14H24N2O4)]
dipole: 0.285264 2.3276088 -1.794286 debye
polarizability: 216.0176569|-7.9906933|158.1500842|-1.5428808|-7.7597959|155.4324456 unknown
InChI: InChI=1S/C14H24N2O4/c1-11-4-6-14(7-5-11)10-16(13(18)20-14)12(17)19-9-8-15(2)3/h11H,4-10H2,1-3H3
charge 0 multiplicity 1
44 atoms
O  -1.780886 -1.083284 0.450774
O  -0.295898 -2.49856 1.561999
O  2.355389 -0.546944 -1.268335
O  2.446114 -1.854151 0.69085
N  0.418102 -0.970452 -0.155127
N  3.926047 1.264065 0.542237
C  -1.675736 0.095122 -0.502061
C  -1.795954 1.384195 0.338708
C  -2.82134 -0.037687 -1.517077
C  -4.329044 1.434312 -0.043467
C  -3.185749 1.515826 1.000026
C  -4.208487 0.117296 -0.852468
C  -0.264433 -0.086814 -1.126808
C  -5.713963 1.557271 0.625265
C  -0.504636 -1.618038 0.721392
C  1.803506 -1.186782 -0.143026
C  3.837565 -0.464672 -1.29245
C  4.29612 0.931199 -0.84651
C  4.003191 2.71594 0.805505
C  4.651115 0.471214 1.559772
H  -1.62263 2.245513 -0.339684
H  -0.992715 1.4015 1.100293
H  -2.742408 -1.016477 -2.026609
H  -2.682019 0.747972 -2.288863
H  -4.205081 2.283584 -0.753036
H  -3.312975 0.702949 1.741511
H  -3.243458 2.47374 1.552373
H  -4.996595 0.076357 -1.629109
H  -4.376914 -0.739569 -0.171051
H  -0.311865 -0.569503 -2.120275
H  0.277056 0.866164 -1.225673
H  -5.878248 0.727387 1.338944
H  -5.807873 2.506671 1.185006
H  -6.527053 1.523377 -0.124025
H  4.248554 -1.271008 -0.661351
H  4.117513 -0.636089 -2.345205
H  5.40549 0.983834 -1.023062
H  3.82946 1.679392 -1.514511
H  3.620579 2.925415 1.82015
H  3.372531 3.263452 0.08193
H  5.042653 3.127164 0.740266
H  4.414353 -0.599787 1.451618
H  4.312322 0.778159 2.56453
H  5.760796 0.610546 1.508438
