program: Gaussian 09
title: 000212323
version: EM64L-G09RevD.01
frameworkgroup: C1[X(C18H17BrN2O2)]
method: RPBEPBE
basis: SDD
operation: Freq
keyword: #p
keyword: freq=noraman
keyword: PBEPBE/SDD
title: #p freq=noraman PBEPBE/SDD
converged: YES YES NO NO
title: Mulliken charges:
elementType: Br O O N N C C C C C C C C C C C C C C C C C C H H H H H H H H H H H H H H H H H
charge: 0.005682 -0.295378 -0.228003 -0.152314 -0.424746 0.046123 -0.507431 0.009529 0.364572 -0.491029 0.390165 0.261914 -0.718140 0.100173 -0.256189 -0.372253 -0.364082 -0.398111 -0.262647 -0.196699 -0.229620 -0.227168 -0.239882 0.234704 0.265011 0.220268 0.245085 0.247724 0.227037 0.237499 0.210454 0.280661 0.323269 0.258038 0.259932 0.238577 0.254409 0.226785 0.226958 0.229122
chargesum: 0.00000
title: Mulliken charges with hydrogens summed into heavy atoms:
elementType: Br O O N N C C C C C C C C C C C C C C C C C C
charge: 0.005682 -0.295378 -0.228003 -0.152314 -0.101477 0.046123 -0.007716 0.229797 0.364572 0.001781 0.390165 0.261914 -0.043149 0.100173 0.024472 -0.114215 -0.104150 -0.159535 -0.262647 0.057710 -0.002836 -0.000211 -0.010759
polarizability: 2.58893445e+02 2.29397020e+01 2.26014635e+02 1.33811056e+01 1.58210142e+01 1.93773558e+02
1716.lowfreq: -6.8858 -1.3541 -0.0008 -0.0005 -0.0003 4.9608 24.2874 38.7604 48.7571
frequency: 24.2531 38.6653 48.7508 56.6154 60.4402 85.8526 121.6461 144.2349 162.0708 174.6976 216.2642 230.7719 235.6431 248.4736 262.7722 285.3880 304.6546 317.7736 357.4390 374.8206 397.8248 406.0960 411.9284 457.3867 465.8688 496.0446 516.0067 542.7923 564.1177 585.6980 614.6879 644.6087 648.2857 683.5097 691.3884 707.8795 715.6828 727.8942 745.8821 766.7801 794.3215 813.8830 832.5049 839.0585 861.2024 869.6152 883.8594 893.0142 911.8711 922.0358 932.6933 947.7819 964.1776 985.4389 989.6181 991.8602 999.2882 1026.5524 1040.7536 1067.7506 1078.6540 1081.4618 1095.7528 1106.5134 1136.2753 1164.5354 1170.9360 1177.0588 1193.9417 1212.3118 1230.7911 1249.3054 1260.6964 1266.0926 1286.2884 1306.5457 1311.9117 1334.8744 1338.2641 1350.3324 1362.4299 1378.8184 1386.5342 1391.1307 1433.2212 1441.7480 1456.3336 1459.8283 1469.3477 1472.6302 1475.4587 1475.9778 1577.7041 1591.0688 1598.6591 1607.2319 1641.1038 2927.9959 2984.1509 2992.1263 3025.4053 3080.5152 3092.2863 3098.9937 3107.6733 3123.8636 3131.6612 3133.4669 3147.0282 3155.0620 3165.7805 3175.5328 3188.0430 3500.1343
redmass: 6.2303 3.6893 4.6885 4.1963 7.4677 5.9441 5.2189 5.5928 4.3503 4.3869 1.7105 2.6665 4.2871 4.2311 5.6919 3.8026 5.8733 5.0644 4.4411 2.0952 4.1203 2.9148 3.2786 4.2576 3.5368 4.4001 3.5130 4.3654 4.1496 2.6926 6.4045 6.5723 6.1008 5.8992 2.1023 2.0213 4.3340 3.0348 3.9210 1.9853 3.2363 1.5877 5.6737 4.7021 1.3018 2.7510 2.1042 1.7810 3.3701 2.9660 1.4254 1.3667 3.1064 1.3762 6.1825 2.5964 1.3380 2.1193 2.0387 2.4198 1.8382 1.9028 1.9143 2.0598 1.5646 2.3431 1.0711 1.3068 2.1073 1.7793 2.3317 2.3442 1.3544 1.4116 1.8349 1.3468 1.2379 1.5673 1.4865 2.5758 3.1313 7.2240 4.7037 1.2843 2.1907 2.2873 1.0785 1.0522 1.0998 2.3848 2.4454 1.0560 7.9912 6.4563 6.7732 6.1748 5.3952 1.0693 1.0365 1.0845 1.0636 1.0988 1.1008 1.1022 1.0935 1.0847 1.0898 1.0882 1.0923 1.0956 1.1010 1.0957 1.0921 1.0753
irintensity: 0.3167 1.0482 0.0346 0.0254 1.9468 0.5120 0.2265 3.0121 1.2104 0.9058 0.8689 1.1813 1.1149 1.0655 3.7175 2.1599 1.8375 3.9998 0.5998 0.8644 2.4763 0.1742 4.9591 16.1949 5.0113 16.9043 24.7503 4.7078 14.4627 16.9011 0.2785 1.1116 12.0406 25.2990 54.1805 37.2735 9.0282 12.3577 14.8453 36.7517 23.3488 48.5200 103.0639 33.1894 4.5944 9.1543 7.5117 26.1407 3.4361 7.6008 4.5967 1.1650 16.6997 0.4990 0.8674 25.9674 3.4011 11.2239 32.8961 10.2577 19.4122 11.8815 9.9382 24.4339 27.2761 22.5971 0.5563 13.9431 5.8346 40.8468 30.7836 12.2604 10.8848 8.4490 12.2718 1.7281 4.9270 69.9002 8.1794 119.5376 11.4314 15.3859 40.4087 16.4817 8.8090 32.3303 11.5159 7.5681 20.1984 64.3381 118.6011 6.5123 16.3522 0.1703 4.6529 2.2017 487.3812 39.0126 23.9403 28.7982 43.6082 37.9243 20.6920 18.0539 17.6546 0.2298 8.9527 7.6629 18.3844 19.9857 21.3116 4.0396 0.9780 23.2004
temp: 298.150 k
press: 1.00000 atm
elementType: 35 8 8 7 7 6 6 6 6 6 6 6 6 6 6 6 6 6 6 6 6 6 6 1 1 1 1 1 1 1 1 1 1 1 1 1 1 1 1 1
symmnumber: 1
zpe: 817709.5 jmol-1
zpe.correction: 0.311449 hartree
zpe.thermalcorrener: 0.331290 hartree
zpe.thermalcorrenthalpy: 0.332235 hartree
zpe.thermalcorrgfe: 0.261706 hartree
zpe.sumelectzpe: -967.879386 hartree
zpe.sumelectthermal: -967.859544 hartree
zpe.sumelectthermalent: -967.858600 hartree
zpe.sumelectthermalfe: -967.929129 hartree
dipole: -0.5485 1.3053 0.5921
dipole: 1.5347
quadrupole: -150.6466 -143.8692 -133.1744
quadrupole: -14.3474 -12.5016 -0.4398
quadrupole: -8.0832 -1.3058 9.3890 -14.3474 -12.5016 -0.4398
hfenergy: -968.1908347 hartree
pointgroup: C01 [X(C18H17Br1N2O2)]
dipole: -0.3529676 -0.3451981 0.3475795 debye
polarizability: 226.6531993|11.2022773|194.4854475|29.3044896|-6.1097094|257.5429907 unknown
InChI: InChI=1S/C18H17BrN2O2/c1-12-10-21-11-17(22)20-16-8-7-14(19)9-15(16)18(21,23-12)13-5-3-2-4-6-13/h2-9,12,20H,10-11H2,1H3
charge 0 multiplicity 1
40 atoms
Br 4.093392 0.999861 2.864245
O  0.340578 -1.939606 0.504876
O  -0.308956 0.802161 -4.236216
N  -0.747383 -0.936596 -1.338639
N  0.573765 1.520315 -2.218146
C  -0.158798 -0.60554 -0.035851
C  -1.463408 -2.21793 -1.083187
C  -0.580589 -2.98457 -0.030836
C  1.049706 0.338859 -0.042104
C  0.161549 -0.896365 -2.509806
C  -1.253131 -0.052333 0.909243
C  1.301343 1.362165 -1.001813
C  0.264353 -4.126314 -0.604092
C  0.122046 0.51888 -3.083093
C  1.90499 0.245473 1.087174
C  -1.303951 -0.439768 2.269077
C  -2.191251 0.887642 0.415463
C  2.345744 2.298783 -0.765226
C  2.940933 1.169176 1.285338
C  3.161904 2.224441 0.375861
C  -2.283224 0.10712 3.128405
C  -3.169256 1.43395 1.275498
C  -3.217272 1.047358 2.635505
H  -1.59646 -2.779932 -2.020893
H  -2.457298 -1.997647 -0.656981
H  -1.210075 -3.347042 0.805413
H  -0.22343 -1.56504 -3.293933
H  1.205299 -1.197877 -2.267355
H  0.859634 -3.779189 -1.467447
H  0.961548 -4.513182 0.159135
H  -0.383526 -4.959973 -0.934357
H  1.732466 -0.560702 1.802993
H  0.566723 2.457933 -2.63364
H  -0.586095 -1.179173 2.639231
H  -2.15814 1.165741 -0.643328
H  2.535373 3.083864 -1.506669
H  3.959457 2.95412 0.538985
H  -2.318906 -0.202079 4.179163
H  -3.894247 2.157459 0.885523
H  -3.976404 1.471857 3.302186
