program: Gaussian 09
title: 000212310
version: EM64L-G09RevD.01
frameworkgroup: C1[X(C16H24NO3)]
method: RPBEPBE
basis: SDD
operation: Freq
keyword: #p
keyword: freq=noraman
keyword: PBEPBE/SDD
title: #p freq=noraman PBEPBE/SDD
converged: YES YES NO NO
title: Mulliken charges:
elementType: O O O N C C C C C C C C C C C C C C C C H H H H H H H H H H H H H H H H H H H H H H H H
charge: -0.242437 -0.267960 -0.266743 -0.097613 -0.363449 -0.322644 -0.409382 -0.571677 -0.618921 -0.344456 -0.553905 0.143986 0.285617 0.295208 -0.329509 -0.340478 -0.732508 -0.239572 -0.219226 -0.206763 0.258210 0.295212 0.312115 0.273068 0.253556 0.225587 0.259196 0.292250 0.261584 0.324433 0.258244 0.267070 0.270962 0.257662 0.275347 0.250100 0.245786 0.275968 0.261599 0.273356 0.260447 0.247653 0.250281 0.252746
chargesum: 1.00000
title: Mulliken charges with hydrogens summed into heavy atoms:
elementType: O O O N C C C C C C C C C C C C C C C C
charge: -0.242437 -0.267960 -0.266743 -0.097613 0.189973 0.262539 0.069762 0.241353 0.230825 0.184168 -0.028457 0.143986 0.285617 0.295208 -0.083723 -0.064510 0.062893 0.008081 0.031055 0.045983
polarizability: 2.66586949e+02 -4.47388427e+00 1.82044817e+02 6.71385083e+00 -7.15349740e-01 1.18633901e+02
1716.lowfreq: -8.6666 -2.2557 -0.0005 -0.0004 0.0007 8.7405 27.1663 33.5419 34.8533
frequency: 26.9732 33.5231 34.6409 47.9101 54.3887 64.0301 89.2315 98.8483 109.0349 140.3462 155.3531 172.2162 200.2359 213.7102 238.1509 252.4598 287.7738 312.8754 323.4993 357.6688 361.2894 386.7628 396.5343 402.6355 414.1127 422.8198 431.0897 465.1642 478.8578 536.6981 568.3095 573.4270 610.5508 612.3571 641.2129 669.8976 692.2099 721.4409 750.8040 771.8628 804.5435 829.6741 857.3000 863.3043 887.4654 923.8785 941.9033 953.6848 972.2394 988.5231 989.2775 996.4000 997.0212 1014.0247 1017.9703 1026.5392 1030.9561 1042.9509 1048.8843 1082.8180 1092.2091 1096.7716 1110.7894 1144.4350 1173.2909 1181.0157 1190.2160 1194.5124 1210.1872 1220.8294 1240.4247 1259.2516 1278.3541 1318.0452 1319.9024 1326.7200 1333.6316 1345.1386 1376.3920 1383.2225 1391.7126 1393.2156 1397.9676 1425.6339 1437.5932 1438.7405 1441.6820 1447.5535 1447.7874 1450.8129 1454.7930 1458.0594 1467.0465 1477.3949 1481.3612 1483.4661 1493.5308 1515.7138 1551.5973 1589.6526 1609.6389 1640.8387 2989.7221 3007.8713 3012.5778 3016.4852 3026.1607 3029.5308 3032.0515 3040.4314 3045.5781 3072.6089 3094.8730 3099.9998 3105.2315 3106.4252 3128.3876 3138.4293 3140.4127 3146.6080 3146.9468 3147.3661 3156.8160 3167.0061 3173.2288 3178.4384
redmass: 5.1505 3.1358 4.0190 1.5471 4.1160 2.2286 4.2816 5.2712 4.5885 4.1588 4.7204 3.3141 1.9352 3.9628 1.8466 1.7048 2.2211 1.7767 4.6270 1.2831 2.0641 2.7536 2.7833 3.2602 3.2002 2.3888 2.4638 3.9189 4.2598 2.3931 3.2536 2.5593 4.5762 6.1061 3.9117 3.2360 1.8084 2.7206 3.6898 1.7244 1.8427 3.2479 1.2586 2.6638 2.6008 2.8293 3.3392 1.5336 3.5051 2.0725 6.0732 1.4064 2.0815 2.2212 1.3695 2.0978 1.8993 1.6868 2.0740 2.1189 1.6783 2.4731 1.3974 1.7105 1.2889 1.0716 3.1360 1.1422 1.3886 1.6626 2.0907 1.3236 1.4732 1.3874 1.1837 1.2146 1.2893 1.5930 1.2472 1.2558 1.2278 8.2166 1.2500 1.1470 1.4045 1.3793 1.2453 1.0698 1.0890 1.0633 1.1052 1.0754 1.0939 1.0695 1.0787 2.1594 1.0591 1.0545 6.1896 6.2025 5.9754 8.4893 1.0625 1.0401 1.0549 1.0399 1.0577 1.0600 1.0380 1.0595 1.0966 1.1017 1.1042 1.0923 1.1066 1.1060 1.1058 1.1049 1.0863 1.0882 1.1029 1.1046 1.0921 1.0966 1.1028 1.1017
irintensity: 0.2035 1.4782 1.0985 1.9522 3.7105 1.1338 2.2838 0.9394 11.2780 2.3039 0.9008 15.7006 5.0355 3.1685 2.3107 5.1645 2.2730 8.0032 8.5951 1.4511 0.8492 2.1864 0.1014 5.9102 2.6785 0.8798 1.2657 1.3061 15.2744 8.7121 12.2237 5.6549 4.1478 1.4861 2.7153 1.2152 48.5813 27.3579 5.0151 62.9134 10.4445 17.7448 0.7061 40.2675 24.8176 72.0431 33.8605 1.7447 51.6302 10.5533 7.5213 0.5298 13.8712 56.9652 0.2789 0.1399 0.4937 15.9297 3.8268 2.4081 16.8581 7.5452 1.0258 4.7317 4.8058 5.3726 341.3011 4.3879 7.0873 0.1470 90.2075 53.3799 30.2051 6.4564 20.7498 3.6678 4.0659 45.9858 0.1587 1.2513 69.1072 4.2658 26.9993 15.0875 77.9039 4.6364 34.1924 35.7655 37.4149 38.2510 31.8198 6.3869 8.0264 11.0545 16.0777 3.2576 26.7079 27.7799 242.4388 36.2201 25.8013 169.1686 16.4655 0.9114 20.7479 23.0916 4.4205 23.0276 13.2969 10.5575 6.9324 8.3865 29.8249 2.4579 5.3530 5.8522 7.7510 3.8887 2.4924 2.2102 2.6166 9.3068 6.4901 12.5352 0.5939 12.7327
temp: 298.150 k
press: 1.00000 atm
elementType: 8 8 8 7 6 6 6 6 6 6 6 6 6 6 6 6 6 6 6 6 1 1 1 1 1 1 1 1 1 1 1 1 1 1 1 1 1 1 1 1 1 1 1 1
symmnumber: 1
zpe: 986228.8 jmol-1
zpe.correction: 0.375635 hartree
zpe.thermalcorrener: 0.396823 hartree
zpe.thermalcorrenthalpy: 0.397767 hartree
zpe.thermalcorrgfe: 0.323909 hartree
zpe.sumelectzpe: -902.751878 hartree
zpe.sumelectthermal: -902.730690 hartree
zpe.sumelectthermalent: -902.729746 hartree
zpe.sumelectthermalfe: -902.803603 hartree
dipole: -2.5967 3.2074 1.6998
dipole: 4.4631
quadrupole: -45.4225 -97.8233 -111.8671
quadrupole: 6.6254 -3.2221 1.6001
quadrupole: 39.6151 -12.7857 -26.8295 6.6254 -3.2221 1.6001
hfenergy: -903.1275127 hartree
pointgroup: C01 [X(C16H24N1O3)]
dipole: 1.075002 -1.1585583 0.7651271 debye
polarizability: 265.4006165|-5.3161533|181.0974236|-14.7325181|-7.2430844|120.7676271 unknown
InChI: InChI=1S/C16H24NO3/c1-14(18)20-13-12-17(2,3)11-7-10-16(19)15-8-5-4-6-9-15/h4-6,8-9H,7,10-13H2,1-3H3
charge 1 multiplicity 1
44 atoms
O  4.188655 1.49768 -0.634737
O  -1.218136 0.530496 -0.567356
O  5.492216 -0.429271 -0.72537
N  2.110395 -1.044864 0.269054
C  0.693012 -1.491552 0.730202
C  1.952733 0.32813 -0.447941
C  -0.217984 -2.026857 -0.395811
C  2.977559 -0.891073 1.518542
C  2.738439 -2.109584 -0.628967
C  3.085154 0.8069 -1.357548
C  -1.709294 -1.795404 -0.066353
C  -2.106541 -0.312588 -0.212483
C  -3.50978 0.097117 0.051622
C  5.403138 0.797733 -0.479546
C  -4.507097 -0.834716 0.459594
C  -3.863998 1.46679 -0.118068
C  6.499968 1.711296 -0.006875
C  -5.827747 -0.403439 0.69417
C  -5.183869 1.893999 0.11614
C  -6.168467 0.959878 0.523206
H  0.856034 -2.261898 1.504674
H  0.247967 -0.60038 1.201905
H  1.015612 0.265009 -1.027434
H  1.773641 1.069521 0.349821
H  -0.03536 -3.104058 -0.55388
H  -0.009638 -1.509657 -1.349629
H  3.074251 -1.873567 2.00616
H  3.971513 -0.531989 1.225078
H  2.495137 -0.17779 2.203997
H  3.794246 -1.849908 -0.803058
H  2.66818 -3.079316 -0.111501
H  2.192055 -2.159292 -1.581283
H  2.661048 1.598882 -1.99693
H  3.504047 0.013855 -1.999458
H  -2.334385 -2.399204 -0.75169
H  -1.957364 -2.150831 0.95355
H  -4.263651 -1.894024 0.593297
H  -3.089137 2.171243 -0.437173
H  6.104619 2.505895 0.644646
H  6.962904 2.202314 -0.883197
H  7.27933 1.13191 0.509477
H  -6.591583 -1.122433 1.006824
H  -5.451604 2.946909 -0.017702
H  -7.196116 1.292337 0.704336
