program: Gaussian 09
title: 000015302
version: EM64L-G09RevD.01
frameworkgroup: C1[X(C6H10O3)]
method: RPBEPBE
basis: SDD
operation: Freq
keyword: #pfreq=noraman
keyword: PBEPBE/SDD
title: #p freq=noraman PBEPBE/SDD
converged: NO YES NO NO
title: Mulliken charges:
elementType: O O O C C C C C C H H H H H H H H H H
charge: -0.234629 -0.176208 -0.246849 -0.464937 0.186159 -0.329783 -0.667965 0.286579 -0.745435 0.231405 0.230581 0.249596 0.249708 0.233636 0.232815 0.213478 0.253960 0.253743 0.244144
chargesum: 0.00000
title: Mulliken charges with hydrogens summed into heavy atoms:
elementType: O O O C C C C C C
charge: -0.234629 -0.176208 -0.246849 -0.002951 0.186159 0.169522 0.011964 0.286579 0.006413
polarizability: 9.29701807e+01 -5.91012796e-01 7.57355686e+01 -6.43388438e-04 2.33203057e-02 5.12784455e+01
1716.lowfreq: -48.3317 -25.0653 -14.1531 -3.8410 -2.7094 -0.0009 -0.0005 0.0003 8.8361
frequency: -47.8630 -24.8224 -10.9038 43.3920 99.2327 169.8223 172.8532 223.8918 258.3497 319.3377 445.8140 452.8578 564.1479 587.4948 637.9724 737.7551 794.4341 873.6992 906.0687 955.7101 994.8941 1017.1205 1043.4056 1054.3071 1083.8281 1117.7106 1192.3013 1204.2014 1254.6316 1320.4102 1345.8572 1383.6735 1397.7780 1431.0402 1444.1628 1452.1225 1452.7310 1468.9157 1478.7829 1647.5495 1663.0909 2964.3063 2983.4886 3001.3858 3007.8764 3009.9849 3036.2995 3097.5492 3098.9509 3103.8083 3146.2199
redmass: 1.7221 1.2841 3.5966 3.4057 4.1269 1.4816 1.6784 4.3339 6.5461 3.7920 2.0300 3.5852 3.0130 6.0472 3.8117 1.2881 4.4283 4.2528 1.4238 4.6706 2.0649 1.7064 1.6651 3.4997 1.7431 2.4044 1.1402 3.6737 1.1672 1.4979 1.8267 1.2519 1.2044 1.0808 1.0887 1.0466 1.0626 1.0388 1.0495 9.6412 8.6929 1.0598 1.0577 1.0361 1.0979 1.0368 1.1022 1.0972 1.1006 1.1000 1.1012
irintensity: 0.4291 5.9734 1.4907 0.7969 6.1105 6.4167 6.9507 9.8353 0.3422 3.8174 0.1862 2.9128 2.6670 15.7055 2.1697 9.5878 7.5321 11.5554 3.4706 65.0094 90.7063 30.1084 10.2214 11.4480 0.8733 53.3142 0.0383 304.9581 0.7197 9.7319 51.8354 61.2173 18.7539 6.8558 34.1498 18.2947 30.2901 13.0375 14.6774 271.3016 8.4431 28.7600 19.4141 24.3830 6.3138 1.5460 14.9366 6.1576 26.0354 30.1886 9.5761
temp: 298.150 k
press: 1.00000 atm
elementType: 8 8 8 6 6 6 6 6 6 1 1 1 1 1 1 1 1 1 1
symmnumber: 1
zpe: 395612.3 jmol-1
zpe.correction: 0.150681 hartree
zpe.thermalcorrener: 0.159365 hartree
zpe.thermalcorrenthalpy: 0.160309 hartree
zpe.thermalcorrgfe: 0.116120 hartree
zpe.sumelectzpe: -459.586426 hartree
zpe.sumelectthermal: -459.577742 hartree
zpe.sumelectthermalent: -459.576797 hartree
zpe.sumelectthermalfe: -459.620986 hartree
dipole: 0.8643 -1.2694 -0.0053
dipole: 1.5357
quadrupole: -48.8605 -60.8953 -51.3218
quadrupole: -12.7798 -0.0099 -0.0002
quadrupole: 4.8320 -7.2028 2.3707 -12.7798 -0.0099 -0.0002
hfenergy: -459.7371068 hartree
pointgroup: C01 [X(C6H10O3)]
dipole: -0.3289738 -0.5067574 0.0044219 debye
dipolederiv: -1.6883313 0.0592076 -0.0034372 0.0766132 -0.4487744 0.0012695 -0.0014599 0.0008185 -0.2673361 -0.6074246 0.026216 0.0001665 0.0347306 -0.7892069 0.0035982 0.0007128 0.0037562 -0.2596397 -0.7320487 -0.0177581 -0.0007279 0.3777673 -0.8965508 0.0023472 -0.0036511 0.0036138 -0.3087802 -0.3095807 -0.1513578 0.0022552 -0.1996686 -0.17425 0.0047942 0.0050578 0.0070056 0.1438858 1.1586793 0.0142432 -0.0038597 -0.0284286 0.918946 -0.0060883 -0.0053604 -0.0068248 0.0604275 0.3245145 0.2229479 0.0005357 0.5098062 0.0613049 0.000703 0.0010278 0.0004947 0.3391116 -0.0220361 0.0376014 -0.0009448 0.0068953 0.0484266 -0.0000824 -0.0007578 -0.0010079 0.0618434 1.8617915 -0.0199211 0.0039386 -0.4798359 1.1948496 -0.0045219 0.0066518 -0.0044825 0.197675 -0.2071053 -0.1579306 0.000289 -0.2352166 -0.2688202 0.0003654 -0.0004267 0.0000738 0.0205396 0.0354847 0.0285486 -0.0603094 0.0514525 0.0274442 0.0939028 -0.0464846 0.1249149 -0.0337877 0.0346921 0.0323862 0.0601616 0.0551587 0.0192891 -0.09593 0.0445275 -0.1278348 -0.0258886 -0.0066793 -0.0130988 0.0061244 -0.1134505 0.0313063 0.0683552 0.0227047 0.0821528 -0.020465 -0.0078772 -0.0130276 -0.0060276 -0.1131732 0.0307758 -0.0686555 -0.0225061 -0.0822737 -0.0199657 0.0845181 0.0073751 -0.0084584 0.0592102 0.0208627 -0.1090064 0.028751 -0.103686 -0.0552706 0.0834429 0.0070023 0.0092587 0.0570638 0.0280588 0.1067885 -0.0299465 0.101373 -0.0642902 -0.110281 -0.1021668 0.0011424 -0.1420806 -0.0164295 0.0019493 0.0017728 0.0020994 0.1065962 0.0936849 0.0051268 0.0523416 0.0049621 0.074796 -0.0795271 0.0158624 -0.0980297 -0.0002999 0.0949305 0.003658 -0.0512973 0.0037156 0.0764034 0.0789361 -0.0147302 0.0974486 -0.003334 -0.0803742 0.0309476 -0.0011515 0.0744785 0.0615684 0.0008023 -0.0017452 0.0003882 0.1289785 unknown
polarizability: 92.9357055|0.9704363|75.7690204|0.0463414|-0.1548805|51.2794689 unknown
InChI: InChI=1S/C6H10O3/c1-3-6(8)4-9-5(2)7/h3-4H2,1-2H3
charge 0 multiplicity 1
19 atoms
O  1.06402 0.414703 -0.007948
O  -1.482807 1.403115 -0.013611
O  2.583281 -1.353805 0.004777
C  -2.589042 -0.784966 0.004031
C  -1.377782 0.15514 -0.00582
C  -0.026284 -0.570746 -0.00545
C  -3.936808 -0.043798 -0.014465
C  2.362391 -0.122123 -0.00388
C  3.384424 0.989927 -0.003374
H  -2.512598 -1.438439 0.898433
H  -2.50473 -1.470246 -0.865352
H  0.056789 -1.226091 0.884268
H  0.055583 -1.228696 -0.893352
H  -4.032227 0.621249 0.860425
H  -4.026481 0.58815 -0.914222
H  -4.774865 -0.762498 -0.003937
H  3.240916 1.635751 0.879936
H  3.251301 1.626359 -0.89509
H  4.397418 0.563713 0.004731
