program: Gaussian 09
title: 000212295
version: EM64L-G09RevD.01
frameworkgroup: C1[X(C18H16N2O2S)]
method: RPBEPBE
basis: SDD
operation: Freq
keyword: #p
keyword: freq=noraman
keyword: PBEPBE/SDD
title: #p freq=noraman PBEPBE/SDD
converged: YES YES NO NO
title: Mulliken charges:
elementType: S O O N N C C C C C C C C C C C C C C C C C C H H H H H H H H H H H H H H H H
charge: 0.304475 -0.292371 -0.291126 -0.048292 0.003571 0.290663 0.091791 0.247301 0.339144 0.342104 -0.378340 -0.344257 -0.240083 -0.323644 -0.354419 -0.370017 -0.393798 -0.702804 -0.240075 -0.231306 -0.240833 -0.515537 -0.534287 0.283244 0.243374 0.228978 0.289128 0.214057 0.271898 0.263473 0.224633 0.225211 0.228008 0.216239 0.233207 0.263420 0.229323 0.222857 0.245092
chargesum: 0.00000
title: Mulliken charges with hydrogens summed into heavy atoms:
elementType: S O O N N C C C C C C C C C C C C C C C C C C
charge: 0.304475 -0.292371 -0.291126 -0.048292 0.003571 0.290663 0.091791 0.247301 0.339144 0.342104 -0.095097 -0.100883 -0.011105 -0.034516 -0.140362 -0.098119 -0.393798 -0.439332 -0.015442 -0.006095 -0.012824 0.197329 0.162985
polarizability: 4.95338796e+02 1.48709292e+00 2.86219143e+02 -1.20447838e+00 1.86450409e+00 9.77855655e+01
1716.lowfreq: -4.3818 0.0015 0.0019 0.0020 1.8180 6.3790 11.7793 26.4312 28.6790
frequency: 11.6727 26.2895 28.6488 38.6601 65.5841 77.7998 98.4956 104.2361 111.6994 138.6347 170.3899 171.8925 202.1795 210.2675 217.4981 247.3739 261.7805 283.5569 303.7838 309.0207 326.3236 367.9015 385.5134 403.3163 437.8013 474.5026 479.8990 525.1643 529.4627 556.9893 565.0205 603.1947 616.2463 622.5073 656.5081 668.8819 676.4567 697.5537 741.6256 748.8668 768.3593 791.3807 793.2408 798.5521 823.5613 853.8719 889.1497 894.5423 902.2605 932.1287 956.2328 981.6344 982.6763 989.2845 1002.7364 1007.4972 1017.1003 1026.9733 1046.8001 1079.8096 1080.7226 1110.7944 1111.5510 1123.0119 1148.9994 1151.9672 1172.0772 1183.2134 1190.3209 1193.4394 1206.0530 1247.1989 1278.0045 1289.0269 1323.8161 1332.0102 1378.9554 1383.8703 1407.5762 1430.4027 1433.7828 1440.2192 1450.5004 1455.3467 1462.2844 1467.2464 1470.9517 1476.0143 1480.4035 1513.2303 1544.7730 1577.7090 1587.1292 1600.3478 1616.0240 2964.0189 2982.4855 3054.1634 3070.8916 3093.8535 3123.1746 3126.5419 3131.5258 3133.9984 3142.7276 3144.5695 3158.6237 3163.8236 3170.0104 3176.9231 3239.3203
redmass: 4.9738 3.7756 5.6236 4.7179 2.1984 5.1654 4.7533 4.1831 2.8215 2.4406 2.5207 4.5517 2.8848 3.2448 3.6018 2.7228 2.4656 2.7302 5.0811 8.3353 5.1061 4.7541 6.3991 2.8212 7.1170 4.4856 4.6271 6.8088 4.1592 5.8971 5.4135 5.2320 6.4148 5.9608 6.5130 7.4651 3.6455 1.9241 2.2149 1.3156 5.8249 2.2926 3.4965 2.7293 6.5978 1.2541 7.8350 1.3686 5.0009 1.4530 9.0021 1.3228 1.3699 6.1937 1.3366 1.5817 4.0503 2.8978 2.5386 1.6516 1.9608 1.2512 1.2574 3.5876 1.3850 1.3773 1.0582 1.2713 1.1899 2.7479 1.6107 2.2280 2.0937 2.8636 2.0608 1.8059 8.4383 6.5617 2.2013 1.4825 2.5113 1.3914 1.7965 1.7383 1.6475 1.0549 3.0795 1.2151 1.0815 3.9465 6.2741 5.9554 6.1894 7.3065 6.0269 1.0326 1.0339 1.1042 1.0886 1.0978 1.0846 1.0999 1.0880 1.1053 1.0865 1.0936 1.0967 1.0916 1.0990 1.0982 1.0946
irintensity: 0.1029 0.2409 0.4778 2.1100 6.1671 0.6041 3.2672 3.3114 3.6269 5.3867 4.7011 3.7640 1.2085 4.9141 6.4794 1.6215 4.3182 4.1366 2.3269 1.6090 3.7110 5.5417 1.0893 0.0087 1.5916 5.8822 7.9258 21.9897 0.1553 1.2040 3.0127 0.9106 0.1284 0.8439 20.4891 72.3516 8.4717 23.7439 19.1146 149.2074 11.8269 3.8446 23.5041 21.4564 22.0297 0.0048 6.3213 0.3533 20.1752 4.2990 37.2222 0.5059 0.0823 0.0444 0.0600 16.2990 12.7345 29.3337 101.3925 23.5304 37.2438 11.9209 0.1378 100.4414 5.4294 6.3351 0.5355 41.5931 1.0615 38.1407 1.5809 205.8324 229.1114 8.1833 33.7214 4.5494 24.7446 27.6423 19.3945 5.5369 45.3586 38.1791 45.2915 38.7545 69.0945 13.9201 35.1899 46.0813 9.9591 0.1654 298.1492 4.7039 3.7107 5.3737 12.4290 79.1327 71.7667 42.9198 16.1106 35.5012 3.9700 23.0784 3.8643 10.7238 6.6584 31.7605 33.1171 7.4525 16.8596 19.2597 3.0734
temp: 298.150 k
press: 1.00000 atm
elementType: 16 8 8 7 7 6 6 6 6 6 6 6 6 6 6 6 6 6 6 6 6 6 6 1 1 1 1 1 1 1 1 1 1 1 1 1 1 1 1
symmnumber: 1
zpe: 776954.3 jmol-1
zpe.correction: 0.295926 hartree
zpe.thermalcorrener: 0.317257 hartree
zpe.thermalcorrenthalpy: 0.318201 hartree
zpe.thermalcorrgfe: 0.242420 hartree
zpe.sumelectzpe: -1351.850718 hartree
zpe.sumelectthermal: -1351.829388 hartree
zpe.sumelectthermalent: -1351.828444 hartree
zpe.sumelectthermalfe: -1351.904225 hartree
dipole: -3.9671 -1.7540 1.0622
dipole: 4.4658
quadrupole: -86.2818 -129.6418 -148.4040
quadrupole: 6.3675 -2.7338 -2.7343
quadrupole: 35.1607 -8.1992 -26.9615 6.3675 -2.7338 -2.7343
hfenergy: -1352.1466447 hartree
pointgroup: C01 [X(C18H16N2O2S1)]
dipole: 1.5220209 -0.802462 -0.3555837 debye
polarizability: 493.8362522|-15.5546776|287.2662558|11.4246541|-5.7373546|98.2409971 unknown
InChI: InChI=1S/C18H16N2O2S/c1-21-16-10-6-9-14(17(16)22-2)11-19-18-20-15(12-23-18)13-7-4-3-5-8-13/h3-12H,1-2H3
charge 0 multiplicity 1
39 atoms
S  -1.94311 3.295894 -0.084973
O  2.414477 -1.816187 0.430845
O  5.236659 -1.873566 0.435992
N  -1.925464 0.623248 -0.022746
N  0.298029 1.682829 0.008948
C  2.450739 0.577502 0.124929
C  3.169344 -0.652862 0.241104
C  4.599993 -0.632253 0.259312
C  -4.327181 -0.031004 -0.069653
C  -3.272463 1.008276 -0.065358
C  3.16666 1.80664 0.018454
C  5.287626 0.595273 0.133263
C  4.567108 1.811183 0.014233
C  0.988626 0.558221 0.113522
C  -5.709113 0.301719 -0.100587
C  -3.957749 -1.403578 -0.041092
C  -1.082778 1.653725 -0.022945
C  -3.476559 2.392457 -0.100635
C  -6.692141 -0.708855 -0.103656
C  -4.942696 -2.413212 -0.044387
C  -6.315148 -2.072658 -0.075822
C  2.709226 -3.009325 -0.393539
C  6.698106 -1.875536 0.546989
H  2.582483 2.727306 -0.064621
H  6.381363 0.617501 0.144526
H  5.116952 2.75371 -0.074696
H  0.49543 -0.423206 0.196704
H  -6.024593 1.351029 -0.121278
H  -2.892773 -1.653323 -0.015325
H  -4.419546 2.932892 -0.135486
H  -7.752704 -0.434003 -0.127314
H  -4.640068 -3.466231 -0.021487
H  -7.08048 -2.856691 -0.077921
H  2.628076 -2.75933 -1.46851
H  1.929732 -3.735186 -0.117332
H  3.71246 -3.402849 -0.169307
H  7.033693 -1.26121 1.404402
H  7.174518 -1.511191 -0.383724
H  6.969563 -2.927949 0.715274
