program: Gaussian 09
title: 000212289
version: EM64L-G09RevD.01
frameworkgroup: C1[X(C14H20Cl2N2O2)]
method: RPBEPBE
basis: SDD
operation: Freq
keyword: #p
keyword: freq=noraman
keyword: PBEPBE/SDD
title: #p freq=noraman PBEPBE/SDD
converged: YES YES NO NO
title: Mulliken charges:
elementType: Cl Cl O O N N C C C C C C C C C C C C C C H H H H H H H H H H H H H H H H H H H H
charge: -0.016242 -0.019493 -0.258668 -0.277166 -0.270849 -0.416273 -0.364100 -0.030864 -0.341606 -0.282511 0.558103 -0.706414 -0.673121 0.358497 -0.686229 -0.271018 -0.287075 0.139487 -0.391720 -0.371548 0.215205 0.213420 0.229284 0.194612 0.195787 0.213348 0.215479 0.296226 0.225605 0.217670 0.219754 0.215600 0.220762 0.212191 0.214071 0.213313 0.217815 0.324296 0.302391 0.251981
chargesum: 0.00000
title: Mulliken charges with hydrogens summed into heavy atoms:
elementType: Cl Cl O O N N C C C C C C C C C C C C C C
charge: -0.016242 -0.019493 -0.258668 -0.277166 0.025377 -0.091977 0.064525 0.198420 0.048792 0.146316 0.558103 -0.043385 -0.024568 0.358497 -0.041029 -0.271018 -0.287075 0.139487 -0.089330 -0.119567
polarizability: 3.00904865e+02 -8.93743400e-01 2.01920438e+02 8.55491331e+00 -7.62302061e-01 1.17250847e+02
1716.lowfreq: -32.1621 -6.0148 -2.8584 -0.0010 0.0018 0.0020 6.7643 18.0714 21.0547
frequency: -28.7157 17.8197 19.7006 24.0736 38.5715 48.3026 58.6432 78.2949 97.1932 105.1558 106.7496 132.5212 157.4114 184.7033 200.6846 202.7265 220.3310 232.5379 242.1863 245.0309 267.1145 296.6048 312.3183 338.0245 357.9931 369.0510 392.0315 434.6616 441.3933 453.1513 497.2503 509.4370 547.7008 560.3842 588.4337 673.1328 706.1566 728.5612 738.4223 746.4590 755.0316 795.6490 802.9652 840.5202 872.4090 894.4000 904.9859 919.9342 920.4780 922.8771 931.7826 947.8781 965.7270 1037.5986 1048.0434 1058.7182 1082.2530 1116.0143 1121.9445 1137.9767 1166.6139 1168.1563 1188.5277 1190.6854 1209.2179 1231.2091 1267.5216 1273.2044 1275.2400 1281.6554 1324.9618 1338.7296 1341.3374 1342.9703 1369.5682 1374.1322 1384.1659 1390.2152 1392.3180 1420.9089 1455.9321 1461.1249 1468.1180 1468.8507 1472.1175 1473.6419 1479.1236 1481.1693 1488.5666 1489.6900 1507.8615 1535.4249 1588.0864 1592.7567 2942.7056 2967.2014 2973.8202 2977.1742 2979.2856 2982.4256 2997.9480 3012.2140 3032.0629 3065.6553 3073.7229 3077.1284 3077.4567 3078.3407 3085.4218 3094.5417 3158.8433 3173.3022 3366.8504 3560.5766
redmass: 2.1460 4.3225 2.9365 3.8653 3.5637 4.3835 5.7765 3.0079 2.7678 4.8485 3.4411 6.2434 7.8792 5.5317 3.9930 1.1148 4.4014 2.3324 1.0916 1.6351 8.7090 5.0766 3.0014 10.3699 3.1706 3.4888 6.0610 2.4567 3.3730 3.6341 2.9532 3.9848 2.1282 4.2052 4.7983 7.2951 2.1169 5.1428 1.0788 4.9433 10.7494 4.8976 1.1902 2.4391 1.5224 4.2323 2.1194 1.3521 1.3070 6.0189 1.1596 1.3690 2.0020 3.4514 3.7859 3.4361 2.2135 1.9925 2.5652 1.3913 2.0592 2.9178 1.6900 1.8629 1.4063 2.9219 1.6567 1.6889 1.3042 1.0754 1.3435 1.5031 1.5136 3.5366 1.4956 1.2648 4.5880 1.2398 1.2153 1.8386 1.7195 1.3508 1.0469 1.0784 1.0896 1.0721 1.0424 1.0805 1.0657 1.0900 1.2232 7.1284 7.2780 7.2381 1.0841 1.0583 1.0558 1.0366 1.0352 1.0363 1.0588 1.1006 1.1065 1.1050 1.0999 1.1002 1.1016 1.0988 1.1004 1.0994 1.0921 1.0927 1.0731 1.0790
irintensity: 1.0506 0.2376 0.1115 0.0791 0.3555 0.1944 7.3606 2.0891 0.3870 1.8966 1.0425 4.1177 2.1970 0.9499 0.1379 0.2228 2.8649 4.8026 0.0216 1.9567 10.4285 4.7844 2.0572 3.3669 10.0558 4.5526 2.0243 9.7662 11.2485 15.5586 27.9638 13.7213 66.5399 13.1211 3.4062 32.8913 39.8974 26.0637 5.2859 32.3789 72.4163 9.4086 1.6416 23.9995 11.6794 40.7481 3.5289 10.3182 20.7177 78.8393 0.6364 3.1286 7.3583 23.8571 32.3111 1.5036 9.4511 17.0070 2.2788 3.4274 0.2314 22.4850 7.5988 17.7635 2.0375 121.8279 92.4535 159.2046 45.9508 0.4114 19.3501 54.3324 0.9979 8.8698 56.1924 24.8044 13.9953 45.4987 5.2454 260.9288 1.4178 31.5061 1.0497 0.2273 2.0741 18.8948 13.2350 3.4018 20.9902 22.3548 30.4022 82.8407 70.2299 5.9577 30.5201 15.5501 45.0017 37.3055 35.1338 15.9433 40.0791 10.3329 2.9571 5.1361 20.0508 62.6203 86.0068 60.2829 12.5056 50.9188 2.6043 5.4205 1.3138 29.5073
temp: 298.150 k
press: 1.00000 atm
elementType: 17 17 8 8 7 7 6 6 6 6 6 6 6 6 6 6 6 6 6 6 1 1 1 1 1 1 1 1 1 1 1 1 1 1 1 1 1 1 1 1
symmnumber: 1
zpe: 837497.1 jmol-1
zpe.correction: 0.318986 hartree
zpe.thermalcorrener: 0.341295 hartree
zpe.thermalcorrenthalpy: 0.342239 hartree
zpe.thermalcorrgfe: 0.263682 hartree
zpe.sumelectzpe: -1723.993070 hartree
zpe.sumelectthermal: -1723.970761 hartree
zpe.sumelectthermalent: -1723.969817 hartree
zpe.sumelectthermalfe: -1724.048374 hartree
dipole: -0.1297 -2.1597 2.0443
dipole: 2.9767
quadrupole: -115.6439 -139.7184 -136.6702
quadrupole: -6.4447 -6.9579 0.8845
quadrupole: 15.0336 -9.0409 -5.9927 -6.4447 -6.9579 0.8845
hfenergy: -1724.3120556 hartree
pointgroup: C01 [X(C14H20Cl2N2O2)]
dipole: -0.0754765 -1.1034558 -0.3849472 debye
polarizability: 300.4498488|-11.7667743|136.2124443|4.0719704|34.9129966|183.4138567 unknown
InChI: InChI=1S/C14H20Cl2N2O2/c1-4-5-6-20-13-11(15)7-10(8-12(13)16)14(19)18-17-9(2)3/h7-9,17-18H,4-6H2,1-3H3
charge 0 multiplicity 1
40 atoms
Cl -2.238124 1.610328 2.157179
Cl -1.424774 -0.995374 -2.696869
O  -3.018942 0.465511 -0.567473
O  3.06653 0.705735 1.648256
N  4.711449 -1.176566 0.388189
N  3.329006 -0.986628 0.082806
C  -5.384285 -0.069354 -0.411977
C  5.618794 -0.252814 -0.387088
C  -6.482766 -1.041478 0.080577
C  -3.985982 -0.543734 -0.022848
C  -1.683642 0.276308 -0.228661
C  7.016826 -0.365004 0.248244
C  5.625358 -0.651734 -1.873176
C  1.104908 0.035808 0.368559
C  -7.899464 -0.562819 -0.303813
C  -1.131145 0.779968 0.980759
C  -0.779161 -0.347858 -1.128265
C  2.561768 -0.035589 0.745427
C  0.233135 0.673491 1.284645
C  0.593799 -0.467686 -0.85449
H  -5.550789 0.937968 0.014472
H  -5.435119 0.032311 -1.512817
H  5.259096 0.795741 -0.291545
H  -6.304749 -2.049682 -0.345773
H  -6.415988 -1.149581 1.182332
H  -3.746499 -1.528987 -0.470249
H  -3.864676 -0.597014 1.076999
H  4.823666 -0.993192 1.401564
H  7.375128 -1.409606 0.207833
H  7.735526 0.272994 -0.29488
H  7.007521 -0.037615 1.305124
H  4.612661 -0.582154 -2.310736
H  5.988665 -1.688747 -1.991281
H  6.285848 0.022322 -2.44797
H  -8.114008 0.429611 0.134524
H  -8.003739 -0.474817 -1.401362
H  -8.672707 -1.266261 0.054773
H  2.904078 -1.7214 -0.482627
H  0.649764 1.083616 2.208959
H  1.246733 -0.914715 -1.610024
