program: Gaussian 09
title: 000212273
version: EM64L-G09RevD.01
frameworkgroup: C1[X(C15H12ClN5O2)]
method: RPBEPBE
basis: SDD
operation: Freq
keyword: #p
keyword: freq=noraman
keyword: PBEPBE/SDD
title: #p freq=noraman PBEPBE/SDD
converged: YES YES NO NO
title: Mulliken charges:
elementType: Cl O O N N N N N C C C C C C C C C C C C C C C H H H H H H H H H H H H
charge: -0.046387 -0.351543 -0.282541 -0.481262 -0.019419 -0.133268 -0.348372 0.013322 0.050173 0.341969 0.135134 -0.251087 -0.329268 0.465821 -0.136013 -0.222229 -0.340718 -0.349284 -0.443405 0.135642 -0.217135 -0.206642 -0.255581 0.309709 0.227549 0.374512 0.260176 0.259042 0.232075 0.307915 0.250831 0.224448 0.226168 0.226433 0.373235
chargesum: 0.00000
title: Mulliken charges with hydrogens summed into heavy atoms:
elementType: Cl O O N N N N N C C C C C C C C C C C C C C C
charge: -0.046387 -0.351543 -0.282541 -0.106750 -0.019419 -0.133268 0.024863 0.013322 0.050173 0.341969 0.135134 0.058622 -0.101719 0.465821 -0.136013 0.037948 0.150399 -0.041369 -0.192574 0.135642 0.007313 0.019526 -0.029148
polarizability: 3.39272368e+02 5.36902837e+00 2.03387091e+02 6.12940173e+00 -2.77827102e+01 1.27659893e+02
1716.lowfreq: -7.8959 -4.1337 -2.3833 -0.0025 -0.0020 -0.0010 0.5471 16.5456 32.4087
frequency: -7.7335 16.4987 32.3717 47.0968 53.0605 73.6686 76.7530 94.9627 139.5049 155.3541 168.0399 196.9446 222.4397 264.7265 286.7794 311.6347 319.0327 349.9689 372.7604 385.2550 409.0808 431.0607 447.1390 510.6212 528.6306 541.9741 582.2479 614.7758 623.0683 650.4681 661.1888 677.1806 685.9800 698.3097 736.0765 749.9642 760.5761 768.3524 789.0829 804.7377 821.6119 833.3453 857.0765 875.3587 901.6960 923.8813 927.1750 931.0763 942.3106 949.9031 965.6742 977.9857 985.5021 999.5033 1008.2218 1026.5433 1065.2941 1084.1944 1095.0204 1107.3809 1135.7403 1149.3256 1161.4613 1171.8523 1192.1991 1207.4418 1215.8168 1248.1142 1271.2282 1295.9423 1325.1317 1345.4657 1374.2433 1380.9502 1388.3434 1403.4180 1435.8303 1449.9339 1455.5904 1459.8092 1486.9223 1537.5920 1563.6850 1589.6576 1597.5138 1615.0067 1618.7886 3059.0505 3121.8232 3130.6711 3131.3032 3143.7944 3151.8574 3163.1478 3164.8558 3176.8158 3197.3129 3380.4554 3598.6286
redmass: 7.3372 7.4683 7.3722 11.0973 4.1668 6.0804 7.0657 6.2490 7.9795 5.8578 8.8701 7.3505 7.1651 5.1613 5.9912 3.4537 4.7949 6.5647 7.7800 8.2720 2.9393 3.9688 5.7939 3.3585 5.0433 4.7258 4.8770 6.3656 7.5494 10.3431 6.5235 5.7644 5.5413 1.9506 1.1562 4.3330 6.2218 1.6890 5.8536 1.5605 1.3212 4.3042 1.2549 6.9302 5.8253 2.7451 1.4746 2.0656 2.6819 1.3670 5.1182 1.4494 4.7158 1.3086 10.0365 2.2384 2.9399 2.0737 1.9507 6.7934 1.7066 6.1849 2.6054 1.0605 1.1199 2.3615 2.9823 1.3968 2.3522 1.5020 1.4128 1.2425 9.3728 3.7215 7.2275 1.6073 2.4026 1.3290 1.8436 7.5325 2.4011 2.4617 5.8868 8.5345 6.1401 5.7015 3.0779 1.0579 1.0866 1.0883 1.1078 1.0941 1.0883 1.1001 1.0919 1.0970 1.0948 1.0793 1.0850
irintensity: 0.7655 2.4428 1.7710 4.5490 0.1919 0.5179 0.8350 1.4551 0.6358 0.6975 1.6446 2.8181 3.7432 0.9713 4.3881 5.8085 2.2320 1.8276 5.4076 5.4780 0.0767 5.5497 11.1545 32.1373 14.2135 16.5442 11.1981 3.5344 31.1943 4.1923 4.7043 5.4374 12.3956 44.5410 125.6165 1.9430 20.3781 46.3472 1.8590 20.6632 113.3025 19.3666 25.7480 20.1972 4.6306 37.2274 34.5886 21.9401 5.8946 10.8972 16.6349 0.3618 0.5571 3.5477 0.2861 11.7214 58.4051 40.7488 18.6511 13.9524 14.8813 2.9028 42.4444 1.9111 0.5761 19.5545 51.5042 73.5097 24.2798 3.1216 26.9032 3.2091 0.0591 4.1785 46.2607 14.1155 73.8657 28.1127 123.2878 7.0406 69.5279 350.0622 36.8642 80.3108 37.2036 11.2669 86.9398 21.7578 4.0533 3.7964 2.3808 25.8190 8.2304 35.8061 9.1346 4.9953 7.4594 182.5643 121.1311
temp: 298.150 k
press: 1.00000 atm
elementType: 17 8 8 7 7 7 7 7 6 6 6 6 6 6 6 6 6 6 6 6 6 6 6 1 1 1 1 1 1 1 1 1 1 1 1
symmnumber: 1
zpe: 664004.3 jmol-1
zpe.correction: 0.252906 hartree
zpe.thermalcorrener: 0.271461 hartree
zpe.thermalcorrenthalpy: 0.272405 hartree
zpe.thermalcorrgfe: 0.203374 hartree
zpe.sumelectzpe: -1461.399083 hartree
zpe.sumelectthermal: -1461.380528 hartree
zpe.sumelectthermalent: -1461.379584 hartree
zpe.sumelectthermalfe: -1461.448615 hartree
dipole: 0.3227 7.0336 -0.3219
dipole: 7.0483
quadrupole: -143.6272 -129.2393 -132.6427
quadrupole: 9.5667 -7.1742 2.8835
quadrupole: -8.4575 5.9304 2.5270 9.5667 -7.1742 2.8835
hfenergy: -1461.6519885 hartree
pointgroup: C01 [X(C15H12Cl1N5O2)]
dipole: -0.0881089 -2.7701352 -0.0908364 debye
polarizability: 332.987993|-16.794685|208.8398323|-32.9131719|-18.8390392|128.4915272 unknown
InChI: InChI=1S/C15H12ClN5O2/c16-10-6-7-13(23-9-14-18-20-21-19-14)12(8-10)15(22)17-11-4-2-1-3-5-11/h1-8,17,20H,9H2
charge 0 multiplicity 1
35 atoms
Cl 5.681144 1.339573 -1.332837
O  0.776118 -1.19943 1.119105
O  0.673673 2.737178 -0.6053
N  -0.580128 1.040115 0.425104
N  -0.185188 -3.231598 -1.432718
N  -1.883569 -2.559821 -0.03473
N  -1.403612 -3.19921 -2.049442
N  -2.459626 -2.796671 -1.237347
C  1.822676 0.685241 -0.03456
C  1.921923 -0.640238 0.484828
C  0.5886 1.575875 -0.090359
C  2.995298 1.270433 -0.581386
C  3.151155 -1.338681 0.463742
C  -1.874864 1.630533 0.462713
C  4.201127 0.559968 -0.612341
C  4.301774 -0.745881 -0.093184
C  0.464221 -2.642667 0.944002
C  -2.138869 2.970819 0.068441
C  -2.940127 0.808533 0.927074
C  -0.518239 -2.824815 -0.168408
C  -3.457207 3.468878 0.15449
C  -4.248515 1.323858 1.007368
C  -4.516881 2.659456 0.623886
H  2.902607 2.28651 -0.977183
H  3.233696 -2.338027 0.901796
H  -0.485999 0.097964 0.831988
H  5.253453 -1.284226 -0.108975
H  0.019407 -2.952175 1.901714
H  1.373706 -3.229291 0.74267
H  -1.319942 3.591356 -0.298349
H  -2.744854 -0.235933 1.199801
H  -3.653746 4.503397 -0.149403
H  -5.059592 0.678665 1.362756
H  -5.534839 3.059074 0.686449
H  -1.532679 -3.44406 -3.031702
