program: Gaussian 09
title: 000212268
version: EM64L-G09RevD.01
frameworkgroup: C1[X(C16H12F3N5O2)]
method: RPBEPBE
basis: SDD
operation: Freq
keyword: #p
keyword: freq=noraman
keyword: PBEPBE/SDD
title: #p freq=noraman PBEPBE/SDD
converged: YES YES NO NO
title: Mulliken charges:
elementType: F F F O O N N N N N C C C C C C C C C C C C C C C C H H H H H H H H H H H H
charge: -0.165675 -0.173526 -0.167697 -0.363652 -0.279555 -0.492616 -0.010331 -0.134077 -0.349811 0.005299 0.049517 0.510690 0.316009 0.350357 -0.583936 0.140342 -0.350995 -0.296124 -0.374047 -0.349821 -0.195374 -0.250581 0.247072 -0.237020 -0.368537 0.140234 0.254789 0.386219 0.319497 0.284322 0.262024 0.281425 0.235612 0.237897 0.237253 0.252292 0.257758 0.374769
chargesum: 0.00000
title: Mulliken charges with hydrogens summed into heavy atoms:
elementType: F F F O O N N N N N C C C C C C C C C C C C C C C C
charge: -0.165675 -0.173526 -0.167697 -0.363652 -0.279555 -0.106397 -0.010331 -0.134077 0.024958 0.005299 0.049517 0.510690 0.316009 0.350357 -0.329148 0.140342 -0.031498 -0.011802 -0.112023 -0.068396 0.040238 -0.012684 0.247072 0.000233 0.141513 0.140234
polarizability: 3.20114189e+02 -1.55413341e+01 2.43401775e+02 6.70859793e+00 7.29260746e+00 1.13048179e+02
1716.lowfreq: -0.0004 0.0004 0.0004 2.8112 4.8848 5.8095 13.3010 20.3959 23.9512
frequency: 13.1435 20.3186 23.8873 29.4396 45.0758 51.2551 73.6034 80.8673 127.4586 131.0064 134.3180 159.4970 186.6039 212.8641 229.4579 251.9057 275.8685 289.5839 307.7317 330.3041 351.2581 357.1158 399.2603 427.2460 442.0684 456.3308 490.2839 505.7772 521.6272 524.4727 569.6784 596.0890 611.4623 626.5392 649.7312 652.9068 675.3198 677.9434 698.5686 704.3049 737.3716 752.7376 766.7685 780.9677 791.7503 812.8320 825.7863 861.9149 870.1012 883.4016 900.0518 901.6712 934.1688 943.6150 954.8868 970.4080 974.4648 981.9312 983.0099 1003.9980 1006.6341 1009.7577 1011.0227 1040.3865 1055.5788 1083.8045 1103.3705 1108.5608 1127.7852 1152.3332 1173.9959 1182.1390 1185.3341 1202.7210 1226.1320 1254.3641 1286.8188 1300.3157 1308.6823 1320.3217 1354.7390 1379.1640 1389.0590 1405.1440 1428.2331 1438.1089 1454.3784 1460.0686 1475.9823 1487.4638 1542.9495 1575.2753 1594.2976 1605.6932 1622.5411 1631.3764 3038.5931 3115.8352 3140.0686 3143.3007 3148.6101 3152.9436 3165.4009 3174.0668 3175.4413 3197.7106 3349.4864 3597.1645
redmass: 7.5432 11.1566 10.9253 7.0903 7.8017 8.4847 6.9372 7.2453 7.6372 5.3455 6.3143 7.1814 6.3511 9.1995 6.6360 5.7252 4.9226 7.9571 6.8871 7.5052 3.4191 4.1228 8.3916 4.6522 4.1384 7.7283 4.7027 7.9783 9.2627 4.0468 6.8280 5.8808 9.4270 6.1079 8.3113 7.5450 5.2035 5.4102 2.1009 7.8242 1.1651 2.9768 5.9094 1.4667 7.9468 1.3992 1.2442 5.7052 7.1444 1.4227 5.2554 1.6181 1.3826 3.2329 4.5323 4.9521 1.4437 10.5858 6.2506 1.3485 1.3794 8.6565 5.2661 4.2614 2.5499 3.5755 1.6705 6.6460 1.8368 5.7520 2.1552 1.3308 1.1179 2.1342 2.4593 2.1623 1.5444 1.4535 1.8905 2.3208 1.2364 9.2824 5.6978 1.6253 3.1335 2.6779 8.0943 1.1394 2.1408 2.9051 3.1242 4.7318 7.9490 5.1302 4.4736 3.0490 1.0607 1.1048 1.0862 1.0920 1.0884 1.0902 1.0941 1.0959 1.1003 1.0955 1.0802 1.0850
irintensity: 0.8522 0.2811 0.0955 1.1023 0.7750 5.2460 2.5833 3.0742 2.3090 1.3473 1.5628 5.0347 2.0896 0.6659 3.3091 2.3312 0.5859 4.3774 0.3885 5.3051 12.5549 1.9778 5.5144 0.4361 0.8080 5.3111 9.2084 19.6531 0.0056 2.0709 8.0311 29.1178 5.1029 3.8051 4.0990 2.3654 1.2944 18.5576 23.8617 2.0478 117.3194 21.0549 7.2205 87.4759 15.7834 78.4472 27.0230 22.5514 17.9949 2.6330 17.1109 76.6679 1.0912 10.0000 63.6138 43.4093 3.3772 214.8576 16.4961 0.5622 11.6044 0.4366 133.7574 168.5958 31.6909 60.3446 0.0927 15.6065 21.8270 15.1539 104.1058 8.8684 2.4145 37.9618 117.5422 74.0842 69.6016 42.0080 68.0546 225.8841 3.1217 3.5181 41.0762 22.0004 11.4817 20.3956 1.5405 44.1819 39.6597 147.5998 501.8603 61.3788 66.1295 65.2051 21.0855 185.6019 21.6492 1.7161 5.0029 5.3931 9.2430 3.3729 5.2274 4.4976 20.0238 8.8671 282.1515 128.8295
temp: 298.150 k
press: 1.00000 atm
elementType: 9 9 9 8 8 7 7 7 7 7 6 6 6 6 6 6 6 6 6 6 6 6 6 6 6 6 1 1 1 1 1 1 1 1 1 1 1 1
symmnumber: 1
zpe: 699379.8 jmol-1
zpe.correction: 0.266380 hartree
zpe.thermalcorrener: 0.288299 hartree
zpe.thermalcorrenthalpy: 0.289243 hartree
zpe.thermalcorrgfe: 0.210798 hartree
zpe.sumelectzpe: -1338.761415 hartree
zpe.sumelectthermal: -1338.739496 hartree
zpe.sumelectthermalent: -1338.738552 hartree
zpe.sumelectthermalfe: -1338.816997 hartree
dipole: 4.1041 2.3629 0.1698
dipole: 4.7388
quadrupole: -156.5477 -141.1471 -146.0641
quadrupole: 12.5329 2.5502 -4.6659
quadrupole: -8.6281 6.7725 1.8555 12.5329 2.5502 -4.6659
hfenergy: -1339.0277951 hartree
pointgroup: C01 [X(C16H12F3N5O2)]
dipole: -1.0509066 1.4408299 0.5435739 debye
polarizability: 310.6212333|-10.7408899|239.6766244|-42.6381261|26.8000658|126.2662845 unknown
InChI: InChI=1S/C16H12F3N5O2/c17-16(18,19)10-4-3-5-11(8-10)20-15(25)12-6-1-2-7-13(12)26-9-14-21-23-24-22-14/h1-8,20,23H,9H2
charge 0 multiplicity 1
38 atoms
F  5.519511 -0.73474 -2.306572
F  4.087461 0.9481 -1.776521
F  5.25969 -0.103424 -0.149735
O  -1.510952 1.021326 -0.207247
O  -1.458471 -3.235524 -0.179533
N  -0.196831 -1.272758 -0.415539
N  -0.311827 3.589768 1.414681
N  -2.592217 3.872055 1.412882
N  -0.755698 4.347242 2.458703
N  -2.133605 4.545332 2.494418
C  -2.601364 -1.122196 0.135343
C  1.080048 -1.805797 -0.708551
C  -2.691687 0.304748 0.134183
C  3.432385 -1.327228 -1.209074
C  2.13424 -0.873703 -0.90412
C  -1.380296 -1.965582 -0.168823
C  1.353786 -3.198799 -0.816501
C  -3.776667 -1.851088 0.454548
C  3.713122 -2.709976 -1.321346
C  -3.899602 0.962509 0.459491
C  2.661946 -3.629027 -1.122682
C  -4.990537 -1.210326 0.764049
C  4.542916 -0.330755 -1.363906
C  -5.046908 0.201147 0.77019
C  -1.56957 2.474214 -0.47089
C  -1.48774 3.300539 0.77599
H  1.939165 0.201612 -0.824806
H  -0.286351 -0.245195 -0.384613
H  0.541008 -3.910354 -0.66318
H  -3.690044 -2.942533 0.44358
H  4.722555 -3.05199 -1.566918
H  -3.953004 2.053233 0.512778
H  2.861261 -4.702194 -1.208503
H  -5.87917 -1.802025 1.004249
H  -5.97727 0.719731 1.025189
H  -2.485778 2.722402 -1.033891
H  -0.686956 2.663919 -1.100836
H  -0.128551 4.74174 3.160714
