program: Gaussian 09
title: 000212267
version: EM64L-G09RevD.01
frameworkgroup: C1[X(C15H13N5O2)]
method: RPBEPBE
basis: SDD
operation: Freq
keyword: #p
keyword: freq=noraman
keyword: PBEPBE/SDD
title: #p freq=noraman PBEPBE/SDD
converged: YES YES NO NO
title: Mulliken charges:
elementType: O O N N N N N C C C C C C C C C C C C C C C H H H H H H H H H H H H H
charge: -0.342801 -0.287409 -0.481029 -0.026502 -0.128424 -0.353451 0.009516 0.049196 0.310269 0.130882 -0.304267 -0.338162 0.459447 -0.247295 -0.236723 -0.291297 -0.349930 -0.462952 0.081402 -0.218763 -0.208363 -0.257614 0.286590 0.239917 0.390330 0.236012 0.231757 0.246350 0.243119 0.308448 0.271263 0.222086 0.224025 0.223926 0.370450
chargesum: 0.00000
title: Mulliken charges with hydrogens summed into heavy atoms:
elementType: O O N N N N N C C C C C C C C C C C C C C C
charge: -0.342801 -0.287409 -0.090699 -0.026502 -0.128424 0.016999 0.009516 0.049196 0.310269 0.130882 -0.017677 -0.098245 0.459447 -0.011283 -0.004966 0.198172 -0.041482 -0.191690 0.081402 0.003323 0.015661 -0.033689
polarizability: 3.12884624e+02 -1.62640533e+01 2.31963270e+02 1.13106090e+00 -3.60946567e+00 9.12367444e+01
1716.lowfreq: -4.2162 -0.0004 0.0003 0.0005 2.6055 4.7528 20.1398 30.2100 43.5485
frequency: 19.9689 30.1149 43.5358 51.6420 60.7279 84.2064 92.6184 108.0763 138.5171 171.6222 219.7294 230.1442 246.0919 281.2636 313.5973 331.2916 361.1527 411.6368 412.5755 439.2299 509.3145 514.4198 532.2753 574.7487 584.6811 614.7605 647.2272 654.6577 672.3442 701.6643 703.0964 734.1794 751.6574 759.7406 766.9804 767.9800 808.3681 815.9086 826.1338 860.6406 862.8794 867.5158 917.7165 932.4132 958.1197 961.8070 979.7238 983.5220 985.6177 995.3057 1000.0705 1002.5584 1015.5615 1026.0846 1044.2983 1073.5153 1093.6186 1102.0556 1125.2504 1146.7289 1170.6538 1172.7307 1175.0696 1192.8684 1200.0692 1227.4552 1267.2284 1273.6164 1279.4787 1326.7761 1352.8215 1380.6593 1388.0225 1405.8005 1428.4955 1436.5432 1460.7602 1477.4349 1485.3832 1488.8255 1536.6650 1571.3834 1594.9732 1601.2827 1616.1023 1621.9143 2978.4237 3049.4892 3121.3872 3129.4979 3137.0959 3141.9618 3151.7833 3161.2211 3163.4856 3174.3110 3197.3129 3405.2497 3602.4387
redmass: 6.8112 6.6591 5.8341 7.6526 4.6937 5.1391 5.9003 4.7539 5.0277 6.4898 6.2527 6.3761 5.6624 4.4982 3.4634 5.2916 9.1500 2.9962 7.3964 3.5767 4.8898 3.9013 3.5387 6.5663 8.2031 6.4527 10.2941 6.5297 4.2474 3.3517 2.7770 1.1476 2.9922 4.6395 1.5530 1.6190 2.4605 1.7629 5.6565 1.4396 1.4865 3.5148 5.8040 1.4343 5.8342 1.4904 8.4009 2.6049 1.9010 1.8645 1.3024 1.3402 8.8428 2.3300 2.4384 2.7401 1.8138 6.8172 1.8821 6.5692 1.0896 1.3491 1.3256 1.1251 2.6897 2.6902 1.8553 2.3360 1.6421 1.4177 1.4121 6.8462 7.0639 1.5802 2.3389 2.4165 1.6288 1.4555 5.0236 2.6254 2.5587 5.3012 7.7520 5.0728 5.4188 3.1606 1.0587 1.1033 1.0858 1.0889 1.0859 1.0944 1.0896 1.1002 1.0936 1.1001 1.0947 1.0790 1.0850
irintensity: 2.2562 2.8131 2.3833 0.9155 0.4017 0.3592 1.2983 4.5071 0.0842 2.8106 2.7758 3.8777 1.6112 0.1639 11.4953 0.9246 9.0614 0.0822 1.5228 0.2068 16.2480 19.8960 1.4946 7.3666 2.2827 0.6042 4.5658 1.6054 5.6155 13.4479 27.7977 123.8874 23.5839 11.4696 4.9070 96.3777 55.0738 65.2187 17.4293 3.7368 1.1498 13.3480 6.7769 21.4896 7.6221 1.1453 65.2065 1.9228 4.2713 3.8533 3.5782 2.0301 6.6838 3.4730 27.4505 53.1402 6.9598 16.1853 19.2808 5.4703 2.1610 36.5413 7.6305 0.7814 114.6386 29.2888 8.6397 66.9336 27.8064 37.7655 4.2482 7.3049 32.0351 16.5531 1.7134 91.5923 42.8416 5.0715 6.9678 108.3283 345.6206 28.8504 86.1578 70.0454 7.1697 97.2551 29.0460 10.9934 3.0068 9.8429 2.3638 17.7939 9.4181 40.1414 14.3260 25.9963 7.9330 189.9328 137.1175
temp: 298.150 k
press: 1.00000 atm
elementType: 8 8 7 7 7 7 7 6 6 6 6 6 6 6 6 6 6 6 6 6 6 6 1 1 1 1 1 1 1 1 1 1 1 1 1
symmnumber: 1
zpe: 690661.3 jmol-1
zpe.correction: 0.263059 hartree
zpe.thermalcorrener: 0.281133 hartree
zpe.thermalcorrenthalpy: 0.282077 hartree
zpe.thermalcorrgfe: 0.213957 hartree
zpe.sumelectzpe: -1002.013308 hartree
zpe.sumelectthermal: -1001.995234 hartree
zpe.sumelectthermalent: -1001.994290 hartree
zpe.sumelectthermalfe: -1002.062410 hartree
dipole: 3.4882 7.1189 0.2405
dipole: 7.9313
quadrupole: -109.8117 -108.5914 -133.0042
quadrupole: -2.6508 -5.2865 5.1045
quadrupole: 7.3241 8.5444 -15.8684 -2.6508 -5.2865 5.1045
hfenergy: -1002.2763673 hartree
pointgroup: C01 [X(C15H13N5O2)]
dipole: -0.7947198 2.9958203 -0.3610979 debye
polarizability: 315.7029825|0.0984308|228.4621245|8.7553414|-7.7361689|91.9195306 unknown
InChI: InChI=1S/C15H13N5O2/c21-15(16-11-6-2-1-3-7-11)12-8-4-5-9-13(12)22-10-14-17-19-20-18-14/h1-9,16,19H,10H2
charge 0 multiplicity 1
35 atoms
O  -1.152351 1.003551 -0.13436
O  -0.680511 -3.224883 -0.163476
N  0.412565 -1.169039 0.127426
N  0.198471 4.167177 -1.040972
N  1.162262 2.685268 0.42828
N  1.533207 4.394403 -0.853247
N  2.156073 3.51439 0.02137
C  -2.058544 -1.242646 -0.02623
C  -2.292702 0.165802 -0.03946
C  -0.716908 -1.957163 -0.039523
C  -3.195272 -2.089987 0.016981
C  -3.604487 0.691726 0.01654
C  1.76936 -1.588994 0.215168
C  -4.507631 -1.580771 0.063822
C  -4.710562 -0.183647 0.070595
C  -1.345599 2.455092 -0.040451
C  2.189728 -2.937944 0.053163
C  2.734783 -0.576817 0.48169
C  -0.004384 3.092333 -0.219292
C  3.563108 -3.250152 0.154176
C  4.100375 -0.908437 0.57752
C  4.526112 -2.248235 0.413112
H  -2.996045 -3.166644 0.012836
H  -3.779973 1.771217 0.014647
H  0.244948 -0.155029 0.187247
H  -5.361149 -2.264814 0.0997
H  -5.723307 0.231438 0.113894
H  -1.779833 2.70508 0.948297
H  -2.020627 2.819821 -0.836621
H  1.443937 -3.709878 -0.141826
H  2.407351 0.460396 0.623291
H  3.880015 -4.29188 0.027908
H  4.831447 -0.118911 0.785297
H  5.588346 -2.5053 0.488678
H  2.038197 5.143076 -1.327777
