program: Gaussian 09
title: 000212265
version: EM64L-G09RevD.01
frameworkgroup: C1[X(C16H14ClN5O2)]
method: RPBEPBE
basis: SDD
operation: Freq
keyword: #p
keyword: freq=noraman
keyword: PBEPBE/SDD
title: #p freq=noraman PBEPBE/SDD
converged: YES YES NO NO
title: Mulliken charges:
elementType: Cl O O N N N N N C C C C C C C C C C C C C C C C H H H H H H H H H H H H H H
charge: -0.051142 -0.349942 -0.283853 -0.475385 -0.030617 -0.113445 -0.355253 0.011747 0.063180 0.310369 0.468668 0.134353 -0.253521 0.453063 -0.328386 -0.341174 -0.454742 -0.416306 -0.337460 -0.133579 -0.241960 -0.370614 -0.811288 0.142210 0.375665 0.308712 0.270038 0.308242 0.223546 0.229096 0.228365 0.258919 0.262754 0.245976 0.229737 0.225711 0.227252 0.371064
chargesum: 0.00000
title: Mulliken charges with hydrogens summed into heavy atoms:
elementType: Cl O O N N N N N C C C C C C C C C C C C C C C C
charge: -0.051142 -0.349942 -0.283853 -0.099720 -0.030617 -0.113445 0.015810 0.011747 0.063180 0.310369 0.468668 0.134353 0.055191 0.453063 -0.058347 -0.032932 -0.231196 -0.187210 -0.109095 -0.133579 0.016958 0.138116 -0.128587 0.142210
polarizability: 3.56167206e+02 3.53013951e+01 2.61797760e+02 9.51456381e-01 8.25586817e+00 1.12023725e+02
1716.lowfreq: -30.8590 -2.5825 0.0013 0.0015 0.0016 1.4072 4.1983 18.6162 21.1938
frequency: -30.8080 18.4731 21.1386 26.3367 39.8802 47.5139 68.5881 79.9456 98.4445 133.4061 150.0927 167.3184 178.2185 192.9375 211.7020 250.1282 293.2101 321.5921 343.8730 354.1147 368.8243 376.9545 386.4396 410.1372 444.6544 458.4741 494.0605 515.2221 537.6195 589.1126 621.1344 635.1879 647.6494 653.4766 672.0924 679.1899 719.4019 736.1171 749.2415 749.9109 781.7039 790.0636 796.9614 812.3786 835.8982 843.7678 855.7007 878.3055 897.2871 930.8437 945.2557 947.7383 951.3480 952.2575 972.1550 984.9869 989.1099 1006.6478 1009.5212 1046.4949 1070.5711 1090.2740 1106.7870 1127.2118 1145.6075 1155.3161 1173.0463 1191.5882 1209.9258 1221.5811 1223.2719 1261.8308 1277.2809 1294.2002 1312.1287 1355.8123 1368.7821 1377.7231 1386.6628 1397.1629 1405.3511 1414.2301 1455.1292 1460.2746 1465.2176 1469.9243 1473.4462 1508.1540 1536.5818 1565.6388 1588.0515 1596.7372 1622.3805 1628.0135 2973.3151 3038.7180 3050.1005 3082.6009 3107.6582 3118.4008 3126.5348 3135.3166 3162.3416 3164.5963 3180.4793 3196.0208 3384.8420 3597.1196
redmass: 1.0237 7.0298 6.8001 7.1527 6.2569 5.8431 6.6895 5.7141 7.1371 5.6016 6.3008 8.1886 7.2132 4.7311 7.3719 9.1034 4.2933 4.4502 4.0773 5.5690 5.1958 4.0229 4.2885 2.9579 3.6978 7.0794 6.4167 2.7886 3.6432 5.2412 6.8556 6.9745 9.4299 7.0418 5.6322 5.9007 3.0038 1.1617 4.4255 4.8112 5.0001 8.2885 1.2973 1.4462 1.5823 4.0332 1.2660 7.2026 5.8293 1.3989 2.3693 1.3487 1.4269 6.4205 5.8305 1.4418 1.3349 10.0701 2.8212 1.5414 3.0424 2.8867 6.6357 1.3112 1.8111 5.3289 2.7280 1.1241 2.5958 3.1847 2.6092 1.3713 2.3658 1.4243 1.4158 1.2460 5.2767 6.9039 4.1051 1.2556 1.6254 3.6650 7.4371 1.6450 1.3929 1.0495 1.1128 2.7498 2.7242 6.2169 9.0205 5.2657 2.6636 5.9236 1.0375 1.0613 1.0973 1.0985 1.0874 1.1041 1.0912 1.0964 1.0886 1.0917 1.0969 1.0942 1.0794 1.0850
irintensity: 0.2765 0.9676 2.2024 0.7048 1.7926 1.5027 0.1216 1.7882 0.6038 1.4495 2.1335 2.6627 4.2717 1.4548 1.5933 1.0382 0.6757 0.5650 2.5623 4.0274 11.6539 1.4049 2.6855 0.1515 0.2976 11.5915 20.8358 42.0987 0.4569 4.2074 49.1220 0.1722 4.2490 12.6893 0.0701 18.3123 1.6470 124.9816 0.5636 1.6572 18.3898 24.0588 5.6953 48.0246 113.3751 28.5550 9.7601 19.8994 5.3723 3.3871 3.0120 3.6058 10.7315 75.7158 35.0988 5.8705 5.0066 0.4462 4.9829 12.2278 61.6161 45.2259 12.3190 8.2323 16.5871 1.9294 83.0435 4.7561 33.9782 70.0138 0.4661 54.9404 20.6423 27.7608 25.2939 1.7876 19.7538 3.6043 38.7669 12.3783 14.1114 16.3087 5.2294 147.7176 43.2444 13.2090 22.7771 58.5177 435.7259 43.7151 76.0010 26.1761 138.4089 0.9235 53.4214 23.4426 23.4087 19.2355 18.3929 1.3445 30.5391 16.3831 1.3111 9.0885 1.5244 4.9846 212.8385 122.7573
temp: 298.150 k
press: 1.00000 atm
elementType: 17 8 8 7 7 7 7 7 6 6 6 6 6 6 6 6 6 6 6 6 6 6 6 6 1 1 1 1 1 1 1 1 1 1 1 1 1 1
symmnumber: 1
zpe: 735249.9 jmol-1
zpe.correction: 0.280042 hartree
zpe.thermalcorrener: 0.300520 hartree
zpe.thermalcorrenthalpy: 0.301465 hartree
zpe.thermalcorrgfe: 0.226810 hartree
zpe.sumelectzpe: -1500.630021 hartree
zpe.sumelectthermal: -1500.609542 hartree
zpe.sumelectthermalent: -1500.608598 hartree
zpe.sumelectthermalfe: -1500.683253 hartree
dipole: -3.5224 6.0925 1.4087
dipole: 7.1770
quadrupole: -119.3657 -154.6737 -144.9261
quadrupole: -18.4179 2.5371 1.3521
quadrupole: 20.2895 -15.0185 -5.2710 -18.4179 2.5371 1.3521
hfenergy: -1500.9100628 hartree
pointgroup: C01 [X(C16H14Cl1N5O2)]
dipole: 0.2754025 2.8005359 -0.2327038 debye
polarizability: 360.1266971|11.8890988|251.5995099|39.6702312|9.0345055|118.2624837 unknown
InChI: InChI=1S/C16H14ClN5O2/c1-10-2-5-12(6-3-10)18-16(23)13-8-11(17)4-7-14(13)24-9-15-19-21-22-20-15/h2-8,18,21H,9H2,1H3
charge 0 multiplicity 1
38 atoms
Cl 5.587834 -2.003321 1.058145
O  0.691525 1.216523 -0.410285
O  0.511743 -3.011298 0.121636
N  -0.720307 -1.043773 -0.223375
N  1.833618 4.128413 0.861043
N  -0.460768 4.126813 0.7162
N  1.24374 4.966095 1.761927
N  -0.146919 4.994765 1.707271
C  1.720167 -0.912663 0.13404
C  1.860957 0.498556 -0.047287
C  -2.037706 -1.559206 -0.362515
C  0.453266 -1.744433 0.00421
C  2.880886 -1.653564 0.472667
C  -4.753459 -2.419399 -0.665798
C  3.111204 1.135056 0.130521
C  -2.357536 -2.941897 -0.317595
C  -3.082924 -0.613126 -0.555882
C  -3.701449 -3.347632 -0.468576
C  -4.414556 -1.0402 -0.704217
C  4.118212 -1.015027 0.627905
C  4.252045 0.376116 0.467054
C  0.793971 2.609522 -0.892636
C  -6.192855 -2.873465 -0.836037
C  0.739013 3.611678 0.219223
H  -0.610882 -0.023176 -0.309272
H  2.758762 -2.734117 0.59596
H  3.210668 2.220255 0.049735
H  -1.558825 -3.669127 -0.163864
H  -2.848575 0.459143 -0.57924
H  -3.933628 -4.418935 -0.431043
H  -5.204675 -0.293029 -0.848611
H  5.219228 0.866767 0.607585
H  -0.094737 2.737926 -1.529175
H  1.705992 2.734897 -1.501293
H  -6.570756 -2.643861 -1.850924
H  -6.29325 -3.961513 -0.681401
H  -6.864803 -2.367284 -0.117735
H  1.776079 5.525417 2.429241
