program: Gaussian 09
title: 000212257
version: EM64L-G09RevD.01
frameworkgroup: C1[X(C11H12N2O3)]
method: RPBEPBE
basis: SDD
operation: Freq
keyword: #p
keyword: freq=noraman
keyword: PBEPBE/SDD
title: #p freq=noraman PBEPBE/SDD
converged: YES YES NO NO
title: Mulliken charges:
elementType: O O O N N C C C C C C C C C C C H H H H H H H H H H H H
charge: -0.269838 -0.222036 -0.261859 -0.405017 -0.118247 -0.312243 0.371980 0.218565 0.104608 0.279598 -0.376231 -0.346231 -0.218783 -0.225457 -0.621072 -0.642221 0.274386 0.330429 0.232137 0.247595 0.228571 0.227548 0.284105 0.230891 0.289092 0.237002 0.230531 0.232196
chargesum: 0.00000
title: Mulliken charges with hydrogens summed into heavy atoms:
elementType: O O O N N C C C C C C C C C C C
charge: -0.269838 -0.222036 -0.261859 -0.074588 -0.118247 -0.037857 0.371980 0.218565 0.104608 0.279598 -0.144094 -0.098636 0.011748 0.006740 0.119152 0.114764
polarizability: 1.71629987e+02 -1.53698174e+01 1.51884111e+02 2.37393224e+01 8.82222565e+00 9.83124740e+01
1716.lowfreq: -8.5679 -0.0002 0.0008 0.0009 1.9325 3.8446 33.2274 50.1125 82.9011
frequency: 33.1366 50.0930 82.9008 97.8863 117.7746 124.7142 139.4370 187.5598 224.1309 241.0930 274.5178 304.1534 326.4336 361.5041 419.9260 426.4221 451.4381 491.0881 501.6285 518.2477 551.0258 574.9097 619.8441 656.9220 680.2424 711.8767 723.4027 754.8477 757.9001 838.2297 849.8510 877.8417 910.4867 928.2670 961.4640 969.0113 970.1508 1028.4261 1057.3315 1091.5127 1102.9724 1133.7166 1141.0526 1167.9985 1178.3573 1237.2892 1241.4635 1262.5324 1269.2720 1305.0688 1341.9508 1371.6982 1384.7338 1414.5184 1415.1328 1441.0610 1468.0172 1469.4604 1485.5922 1491.8126 1492.5622 1499.9206 1595.2527 1604.2193 1619.6841 1651.2659 2967.2960 2974.8030 3050.1906 3051.9642 3092.5260 3121.8276 3124.2298 3130.0672 3145.1250 3160.8209 3176.1893 3530.1930
redmass: 4.0105 3.9698 4.2834 2.8123 1.5453 1.2596 3.5315 4.4929 4.7660 2.9267 4.9951 5.2111 5.9929 3.8395 3.1561 5.7345 3.8654 4.9920 6.0947 5.9604 3.8476 6.2453 2.4588 7.0222 2.7016 3.5890 4.3169 1.3141 5.0264 6.0216 1.4580 4.9608 5.4046 1.3857 4.7939 1.3531 3.3932 2.0494 1.4164 1.2275 1.9485 1.7708 1.4254 1.0850 2.3858 3.7922 2.2498 1.4721 1.8336 1.3522 3.1141 3.0301 3.1000 1.2131 2.7887 1.1696 1.1939 1.9967 1.0684 2.3405 1.3391 1.0952 6.5581 6.6621 7.5137 6.6854 1.0398 1.0365 1.0990 1.0998 1.0867 1.0977 1.0975 1.0880 1.0886 1.0940 1.1003 1.0768
irintensity: 3.7725 2.0140 4.2209 0.3964 0.1102 0.0272 0.3285 1.1021 5.0370 1.5122 6.2605 4.2810 7.0900 18.0653 2.8276 2.9092 7.2498 3.0487 16.5566 22.0730 2.4752 0.8114 26.7333 18.5029 33.5724 17.6291 1.1330 128.2488 22.2673 1.2003 0.8145 7.5444 24.6868 4.9331 11.5588 2.3173 53.8342 13.0998 8.8874 1.7906 65.2220 68.9519 6.9212 2.8219 44.0461 34.2412 2.5644 9.3802 8.6916 8.2566 148.2280 32.8705 27.8556 31.1853 6.4675 2.4033 12.7181 3.1176 9.5103 87.0475 88.8475 7.4900 253.7865 29.1478 55.6845 468.0676 44.0707 85.9416 50.5050 4.0132 8.7076 1.7200 3.3259 5.7341 6.6813 17.5587 13.8835 34.8120
temp: 298.150 k
press: 1.00000 atm
elementType: 8 8 8 7 7 6 6 6 6 6 6 6 6 6 6 6 1 1 1 1 1 1 1 1 1 1 1 1
symmnumber: 1
zpe: 569419.3 jmol-1
zpe.correction: 0.216880 hartree
zpe.thermalcorrener: 0.231613 hartree
zpe.thermalcorrenthalpy: 0.232557 hartree
zpe.thermalcorrgfe: 0.174539 hartree
zpe.sumelectzpe: -760.383979 hartree
zpe.sumelectthermal: -760.369246 hartree
zpe.sumelectthermalent: -760.368302 hartree
zpe.sumelectthermalfe: -760.426320 hartree
dipole: 0.1341 -4.1868 -1.0380
dipole: 4.3156
quadrupole: -73.8588 -95.8591 -97.5353
quadrupole: 12.2657 7.6671 1.9907
quadrupole: 15.2256 -6.7747 -8.4509 12.2657 7.6671 1.9907
hfenergy: -760.6008594 hartree
pointgroup: C01 [X(C11H12N2O3)]
dipole: 0.148499 -1.691386 0.0011182 debye
polarizability: 166.5084374|-8.0002433|151.9794862|33.8445129|-3.578046|103.3386486 unknown
InChI: InChI=1S/C11H12N2O3/c1-13(2)11(15)9-10(14)12-7-5-3-4-6-8(7)16-9/h3-6,9,12H,1-2H3
charge 0 multiplicity 1
28 atoms
O  0.097146 -0.616056 -1.495366
O  -0.834819 2.903205 -1.513802
O  -1.642117 0.859445 1.036931
N  0.986373 1.846622 -0.508243
N  -2.662831 -0.895228 -0.120977
C  -0.903352 0.464775 -1.270156
C  1.668217 0.669191 -0.114265
C  1.208876 -0.576437 -0.61802
C  -0.259033 1.854617 -1.116881
C  -1.772997 0.159737 -0.016212
C  2.815266 0.700699 0.709554
C  1.887653 -1.770784 -0.32456
C  3.501341 -0.49679 1.008942
C  3.042652 -1.73053 0.490304
C  -3.540191 -1.200089 1.024125
C  -2.843855 -1.728238 -1.324177
H  -1.50845 0.480297 -2.189237
H  1.397347 2.760116 -0.297797
H  3.168337 1.657733 1.111523
H  1.510969 -2.71098 -0.738673
H  -3.336493 -2.217029 1.409481
H  -4.602401 -1.140838 0.719854
H  -3.344898 -0.463806 1.818005
H  -3.019476 -2.774119 -1.013519
H  -1.942251 -1.720137 -1.952789
H  -3.717753 -1.39533 -1.918923
H  4.390142 -0.465225 1.647193
H  3.5754 -2.658325 0.721687
