program: Gaussian 09
title: 000212254
version: EM64L-G09RevD.01
frameworkgroup: C1[X(C16H15NO3)]
method: RPBEPBE
basis: SDD
operation: Freq
keyword: #p
keyword: freq=noraman
keyword: PBEPBE/SDD
title: #p freq=noraman PBEPBE/SDD
converged: YES YES NO NO
title: Mulliken charges:
elementType: O O O N C C C C C C C C C C C C C C C C H H H H H H H H H H H H H H H
charge: -0.283158 -0.439451 -0.195722 -0.386137 -0.338415 0.529597 -0.649444 0.231097 0.406406 -0.391102 -0.410224 0.149521 -0.389651 -0.378193 -0.219300 -0.224453 -0.240548 -0.222005 -0.222961 -0.239632 0.292278 0.372938 0.248934 0.250432 0.250886 0.253072 0.238298 0.242260 0.225413 0.230359 0.230672 0.228826 0.229515 0.230458 0.389437
chargesum: 0.00000
title: Mulliken charges with hydrogens summed into heavy atoms:
elementType: O O O N C C C C C C C C C C C C C C C C
charge: -0.283158 -0.050014 -0.195722 -0.013199 -0.046137 0.529597 -0.150078 0.231097 0.406406 -0.140216 -0.157153 0.149521 -0.151353 -0.135933 0.006113 0.005906 -0.009877 0.006821 0.006553 -0.009173
polarizability: 1.91704455e+02 -2.71501530e+01 1.64943212e+02 3.11323519e+01 1.50281634e+01 1.77111561e+02
1716.lowfreq: -15.0464 -14.1827 -3.0699 -0.0009 -0.0008 -0.0005 1.8189 17.4819 23.8615
frequency: -14.9440 17.3222 23.7435 37.2163 42.8286 52.9762 58.5787 105.1378 120.2002 187.1846 224.3784 230.4445 296.5698 314.7681 321.1524 340.3607 401.5218 402.7038 424.6138 483.6568 488.5888 544.1626 570.0131 582.9579 602.6268 613.8872 616.4713 625.6186 632.7434 651.6788 697.4554 704.8607 706.2771 760.1037 771.0758 829.1489 832.6398 853.9238 857.0482 860.4231 917.3022 924.2174 928.1748 938.0536 979.7113 980.2550 989.6495 990.9034 998.2919 998.9551 1025.6543 1026.4879 1069.5792 1081.4982 1090.4951 1094.5868 1172.1899 1173.7018 1178.9585 1189.0415 1189.9813 1193.0554 1209.0125 1223.7986 1260.2679 1282.4047 1294.0452 1307.6975 1327.8675 1348.7651 1380.0836 1387.5856 1439.1391 1446.4097 1446.7839 1474.4036 1480.6527 1483.5168 1590.5268 1594.8452 1599.5402 1608.6757 1613.9862 1679.2648 3008.6410 3055.8508 3062.3267 3120.0148 3121.0759 3122.8722 3130.9592 3135.2279 3141.8590 3147.2946 3151.6448 3164.6087 3166.1923 3520.5839 3531.0441
redmass: 4.8284 3.8223 3.8446 7.7311 6.0858 7.3790 6.3934 5.7977 5.8928 4.6743 5.3451 6.2642 5.8375 3.1431 2.8047 7.1152 2.7994 2.8249 5.6097 3.6716 3.4529 3.3408 2.3236 3.5768 4.7907 5.6534 5.8696 1.2684 2.0073 4.1371 5.0205 1.6930 1.7859 2.0411 1.9731 3.7772 5.1220 1.4556 1.4930 2.0287 1.9057 2.0659 1.6162 2.3863 1.4035 1.3884 6.2768 5.7265 1.3102 1.3336 2.3571 2.2049 2.3450 1.5984 2.0233 2.8541 1.0727 1.0617 1.1230 1.2737 1.9139 1.2451 2.0171 2.2500 1.5481 1.6612 1.8093 1.5364 1.2687 1.3246 8.1225 4.9355 2.1087 1.1708 2.0659 1.8797 2.1588 2.3132 6.0107 6.1619 8.0925 5.9982 6.2370 9.2677 1.0606 1.0841 1.1001 1.0860 1.0881 1.0855 1.0876 1.0913 1.0924 1.0960 1.0964 1.1016 1.1016 1.0643 1.0780
irintensity: 0.1965 0.3970 0.1383 4.6549 2.1945 1.9349 2.2791 0.2911 0.6595 0.3239 5.0924 2.2692 0.9508 1.3206 1.1377 3.0456 0.0939 0.0052 8.0766 14.5477 6.5225 29.8734 74.3983 35.8348 23.0583 9.6652 0.1807 38.6804 106.5385 12.0964 22.1544 93.6048 29.2552 19.4696 47.0354 6.3297 1.9130 6.2913 6.4094 19.0386 1.6576 14.4830 24.0871 14.6972 0.3206 0.0910 0.0074 1.9359 0.3549 0.3999 4.8356 5.7826 43.6469 11.3473 102.9911 14.0722 0.0955 0.1610 0.4130 1.3037 2.1000 3.8256 18.9604 31.3384 4.7855 39.6030 21.7037 19.2762 0.2178 6.3520 0.0121 0.7027 8.7433 90.5641 8.9460 195.7529 56.9715 22.1514 2.5877 32.2692 209.8163 6.1744 6.8735 257.6725 11.6801 9.3995 3.4619 6.3852 2.5065 1.3403 0.9202 10.5085 15.5236 35.5350 25.2561 20.2525 20.5142 28.6807 57.3961
temp: 298.150 k
press: 1.00000 atm
elementType: 8 8 8 7 6 6 6 6 6 6 6 6 6 6 6 6 6 6 6 6 1 1 1 1 1 1 1 1 1 1 1 1 1 1 1
symmnumber: 1
zpe: 718221.6 jmol-1
zpe.correction: 0.273556 hartree
zpe.thermalcorrener: 0.290687 hartree
zpe.thermalcorrenthalpy: 0.291631 hartree
zpe.thermalcorrgfe: 0.225074 hartree
zpe.sumelectzpe: -897.727041 hartree
zpe.sumelectthermal: -897.709910 hartree
zpe.sumelectthermalent: -897.708966 hartree
zpe.sumelectthermalfe: -897.775524 hartree
dipole: -2.4934 -1.7563 -3.7592
dipole: 4.8408
quadrupole: -110.5302 -114.9044 -115.8508
quadrupole: -13.5146 3.7381 -0.4133
quadrupole: 3.2316 -1.1426 -2.0890 -13.5146 3.7381 -0.4133
hfenergy: -898.0005974 hartree
pointgroup: C01 [X(C16H15N1O3)]
dipole: -1.0662294 -1.1680259 -1.0611434 debye
polarizability: 167.5440849|-4.1877264|185.6088177|44.7845047|-1.2429338|180.6063254 unknown
InChI: InChI=1S/C16H15NO3/c18-14(11-12-7-3-1-4-8-12)17-15(16(19)20)13-9-5-2-6-10-13/h1-10,15,17,19H,11H2
charge 0 multiplicity 1
35 atoms
O  0.241206 2.028629 2.009232
O  0.904215 0.418634 -2.50876
O  2.93812 1.469519 -2.097127
N  0.046934 0.898847 -0.010984
C  1.505276 0.805657 -0.1899
C  2.100598 -0.495499 0.382938
C  -2.027325 1.538557 1.210857
C  -0.485191 1.506633 1.108362
C  -2.801899 0.832222 0.111693
C  1.881726 -1.745391 -0.249924
C  2.849531 -0.442707 1.582635
C  1.888053 0.963363 -1.660604
C  -3.287353 1.549037 -1.013434
C  -3.0434 -0.566093 0.179023
C  2.410373 -2.927644 0.312584
C  3.376902 -1.626804 2.144992
C  3.160637 -2.871541 1.510608
C  -3.996444 0.889377 -2.043089
C  -3.751904 -1.229225 -0.848089
C  -4.231071 -0.503004 -1.963598
H  1.951195 1.654725 0.356661
H  -0.563556 0.475144 -0.714326
H  -2.301734 2.608322 1.265049
H  -2.264976 1.111762 2.202628
H  1.300197 -1.793821 -1.178258
H  3.000926 0.520832 2.081612
H  -3.113824 2.630335 -1.078108
H  -2.679131 -1.133865 1.044173
H  2.241037 -3.890704 -0.182189
H  3.953026 -1.577495 3.075491
H  3.572165 -3.789403 1.945205
H  -4.369233 1.460339 -2.900905
H  -3.934325 -2.30735 -0.776155
H  -4.784882 -1.015191 -2.758253
H  1.187129 0.517605 -3.457543
