program: Gaussian 09
title: 000212227
version: EM64L-G09RevD.01
frameworkgroup: C1[X(C13H16Cl2N2O2)]
method: RPBEPBE
basis: SDD
operation: Freq
keyword: #p
keyword: freq=noraman
keyword: PBEPBE/SDD
title: #p freq=noraman PBEPBE/SDD
converged: YES YES NO NO
title: Mulliken charges:
elementType: Cl Cl O O N N C C C C C C C C C C C C C H H H H H H H H H H H H H H H H
charge: -0.022125 -0.015001 -0.260532 -0.221116 -0.437567 0.055335 -0.247945 -0.376957 0.554047 0.322276 -0.289459 -0.268235 -0.368587 -0.392657 -0.676380 0.172387 0.182170 -0.762014 -0.793869 0.210321 0.214564 0.221602 0.223658 0.249574 0.301689 0.210321 0.228480 0.212442 0.315997 0.227639 0.266329 0.227787 0.239879 0.238582 0.257363
chargesum: 0.00000
title: Mulliken charges with hydrogens summed into heavy atoms:
elementType: Cl Cl O O N N C C C C C C C C C C C C C
charge: -0.022125 -0.015001 -0.260532 -0.221116 -0.121571 0.055335 0.176941 0.068303 0.554047 0.322276 -0.289459 -0.268235 -0.119012 -0.090967 -0.025137 0.172387 0.182170 -0.040259 -0.058045
polarizability: 3.05132383e+02 1.40016541e+01 1.99936203e+02 -4.40326267e+00 1.63674197e+00 1.04855714e+02
1716.lowfreq: -13.1764 -8.2197 -2.4976 0.0013 0.0023 0.0029 7.9510 21.7593 28.1558
frequency: -3.0468 21.7102 28.0385 42.1270 47.9258 54.3442 90.9145 98.9796 116.2944 134.4162 145.0262 149.8041 167.4556 191.4978 199.6104 208.9428 218.4714 248.3394 262.4865 285.1220 307.6891 332.7238 339.5317 389.1275 403.4833 420.1214 461.8279 478.0527 504.6952 537.9708 558.3843 590.6740 605.7786 660.2632 722.2407 737.9422 754.5727 760.9642 774.8913 824.9778 866.7200 883.9356 891.1678 917.1948 919.9088 941.7051 952.9671 958.2316 989.4256 1044.9397 1052.9234 1078.7229 1084.2986 1132.6649 1135.0392 1136.0523 1185.3428 1218.6802 1224.8438 1244.8251 1281.2571 1282.3028 1308.0671 1342.5716 1369.8054 1379.3933 1384.7123 1394.0569 1394.8806 1436.6365 1449.9012 1460.9592 1462.1261 1472.4677 1478.7905 1479.1670 1480.9499 1489.4649 1502.2368 1536.6532 1590.6749 1606.9609 1623.1727 2958.9841 2971.0967 2971.9385 2979.6056 3007.9636 3031.8374 3031.9151 3044.1849 3057.3493 3084.4474 3085.0482 3104.9670 3119.0330 3151.1235 3172.6729 3431.1596
redmass: 3.8123 5.2505 3.6607 1.6613 5.1487 5.1318 4.0048 2.6743 5.4337 1.1750 4.8200 5.6342 14.6449 1.1630 4.5395 4.3096 1.1484 5.3253 5.6355 4.9176 5.4841 3.8844 9.4918 3.4393 5.0934 5.3587 4.1176 2.3699 5.0426 6.3922 4.1382 1.5900 4.6626 8.5087 7.3313 4.1910 9.6780 1.0918 5.8738 4.8905 1.5341 1.1714 2.1193 1.4610 4.1943 4.2213 1.2676 1.4291 4.2187 3.1855 2.9085 1.6555 2.3899 1.5038 2.0744 2.6047 1.6889 2.0106 1.3102 5.4970 3.6408 1.1092 1.3775 4.7251 1.4954 1.3042 4.2486 1.2138 1.2469 1.7025 1.5539 1.1733 1.0483 1.0845 1.0696 1.0477 1.0415 1.0893 1.4803 8.8605 7.2544 6.6949 9.0805 1.0398 1.0384 1.0551 1.0367 1.0599 1.1061 1.0974 1.0971 1.1024 1.0994 1.1032 1.0956 1.0976 1.0920 1.0927 1.0750
irintensity: 1.4673 3.2198 0.6225 0.6419 0.0767 1.2562 3.0092 2.3470 0.5486 0.3041 3.7383 4.3317 0.8312 0.5302 0.1966 0.8041 0.2673 10.0308 3.1494 2.6787 6.4695 3.7894 1.5551 0.5635 1.3454 3.0493 11.5562 9.7370 0.0594 1.2995 10.0769 63.6002 4.8060 50.5814 17.8747 22.8218 73.6203 12.1564 5.3232 11.5260 14.4014 2.9776 10.6412 19.5951 1.5815 151.4118 0.0957 7.7636 34.8195 25.6563 1.2982 4.8074 7.9183 1.6557 30.9616 81.6755 19.8967 34.4060 7.8227 515.4633 31.4439 0.1477 2.8704 13.8419 20.7981 30.2846 22.1824 22.6004 7.7784 242.7003 46.1570 28.9736 22.1352 0.5662 3.1822 14.8269 13.7454 13.0153 137.4291 77.9601 10.7378 40.0689 130.0873 10.3342 32.0590 23.4156 46.1595 24.9790 9.4883 16.1955 21.9724 0.1675 46.3629 65.1732 17.0437 10.4818 4.1684 5.3431 20.5556
temp: 298.150 k
press: 1.00000 atm
elementType: 17 17 8 8 7 7 6 6 6 6 6 6 6 6 6 6 6 6 6 1 1 1 1 1 1 1 1 1 1 1 1 1 1 1 1
symmnumber: 1
zpe: 700697.9 jmol-1
zpe.correction: 0.266882 hartree
zpe.thermalcorrener: 0.287408 hartree
zpe.thermalcorrenthalpy: 0.288352 hartree
zpe.thermalcorrgfe: 0.215072 hartree
zpe.sumelectzpe: -1683.589338 hartree
zpe.sumelectthermal: -1683.568812 hartree
zpe.sumelectthermalent: -1683.567868 hartree
zpe.sumelectthermalfe: -1683.641148 hartree
dipole: -0.6395 -5.5192 3.3933
dipole: 6.5104
quadrupole: -105.3111 -133.6963 -127.7824
quadrupole: 19.6089 0.0372 -0.3734
quadrupole: 16.9521 -11.4330 -5.5192 19.6089 0.0372 -0.3734
hfenergy: -1683.8562197 hartree
pointgroup: C01 [X(C13H16Cl2N2O2)]
dipole: 0.1917179 -2.3564209 -0.9854785 debye
polarizability: 304.3632698|-17.1049409|197.9220958|-3.4956491|-15.8951512|107.638934 unknown
InChI: InChI=1S/C13H16Cl2N2O2/c1-4-5-19-12-10(14)6-9(7-11(12)15)13(18)17-16-8(2)3/h6-7,17H,4-5H2,1-3H3
charge 0 multiplicity 1
35 atoms
Cl -1.662912 -2.504546 1.291741
Cl -2.845569 2.626616 -0.522621
O  -3.457559 -0.166229 0.558665
O  2.515387 2.23627 -0.029426
N  3.023975 -0.054285 -0.194946
N  4.401759 0.166795 -0.257856
C  -4.237563 -0.616861 -0.639474
C  -5.691588 -0.757686 -0.191924
C  -2.105094 0.083628 0.349544
C  0.694195 0.641478 0.10079
C  -1.119606 -0.882336 0.681361
C  -1.629642 1.343922 -0.106766
C  0.257777 -0.622644 0.573335
C  -0.263549 1.632822 -0.226779
C  -6.59483 -1.236557 -1.350296
C  2.149201 1.031155 -0.035343
C  5.175544 -0.878191 -0.473675
C  6.661329 -0.613031 -0.527539
C  4.683784 -2.307597 -0.666381
H  -3.820456 -1.584442 -0.983683
H  -4.13089 0.139123 -1.442262
H  -5.736556 -1.471032 0.651586
H  -6.040843 0.218875 0.190742
H  0.964357 -1.390217 0.903888
H  0.088067 2.61573 -0.552864
H  -6.271248 -2.222415 -1.733646
H  -7.640928 -1.335189 -1.01113
H  -6.581357 -0.522515 -2.194936
H  2.630447 -0.993399 -0.33434
H  7.194989 -1.196113 0.248176
H  6.86015 0.458212 -0.370335
H  7.08098 -0.917301 -1.506224
H  3.999349 -2.39497 -1.534612
H  4.14273 -2.679965 0.227489
H  5.530772 -2.987904 -0.844956
