program: Gaussian 09
title: 000212226
version: EM64L-G09RevD.01
frameworkgroup: C1[X(C13H14Cl2N2O2)]
method: RPBEPBE
basis: SDD
operation: Freq
keyword: #p
keyword: freq=noraman
keyword: PBEPBE/SDD
title: #p freq=noraman PBEPBE/SDD
converged: YES YES NO NO
title: Mulliken charges:
elementType: Cl Cl O O N N C C C C C C C C C C C C C H H H H H H H H H H H H H H
charge: -0.017457 -0.016766 -0.254117 -0.221471 -0.437669 0.055364 0.321028 0.552012 -0.392782 -0.363873 -0.255739 -0.298917 0.173856 -0.354906 0.182304 -0.762015 -0.793926 -0.037327 -0.547095 0.302411 0.248587 0.227573 0.226866 0.315790 0.227848 0.227857 0.266338 0.239934 0.257547 0.238621 0.246210 0.224164 0.219751
chargesum: 0.00000
title: Mulliken charges with hydrogens summed into heavy atoms:
elementType: Cl Cl O O N N C C C C C C C C C C C C C
charge: -0.017457 -0.016766 -0.254117 -0.221471 -0.121879 0.055364 0.321028 0.552012 -0.090371 -0.115286 -0.255739 -0.298917 0.173856 0.099533 0.182304 -0.039973 -0.057825 0.208884 -0.103181
polarizability: 3.20380507e+02 -4.60116711e+00 2.00029493e+02 2.07890569e-01 -4.83487084e+00 9.48152752e+01
1716.lowfreq: -7.9455 -3.0953 -0.0025 -0.0019 -0.0007 3.5694 11.8618 20.2917 30.2770
frequency: 11.4650 20.2667 30.2538 48.8651 53.1482 63.6801 90.5706 93.5380 130.5134 137.9485 149.6293 159.9241 169.0496 193.3254 200.0236 210.0486 253.8407 278.1114 287.7099 318.4952 337.6388 350.8406 388.3877 413.5045 422.1039 462.2061 477.2811 504.4467 537.1755 557.5412 590.5397 596.9453 607.8688 675.3352 720.4827 736.5765 755.2945 772.9663 821.6690 866.7906 888.4996 918.1813 921.5325 929.0721 953.2842 958.2661 963.1236 977.8856 989.9823 1013.1453 1047.5752 1078.9534 1084.3899 1135.6905 1140.5973 1185.6209 1213.5104 1220.6679 1244.2089 1281.3189 1281.4646 1340.4788 1344.2951 1379.8930 1385.4550 1394.8260 1425.9810 1438.4707 1450.5204 1461.3793 1462.0820 1467.0936 1479.3965 1503.3375 1536.5959 1590.8785 1607.0551 1623.5083 1664.0215 2959.0456 2971.4038 2980.8011 3031.9537 3044.6261 3051.5351 3093.8363 3105.0283 3118.7952 3129.3664 3151.9431 3171.8251 3204.2781 3432.5939
redmass: 4.6514 5.0843 3.8039 5.0041 4.6563 2.2912 3.7031 4.1178 3.4955 1.3283 5.6455 4.4045 13.1241 1.2172 4.3026 4.0749 7.8827 4.1777 4.9283 4.0922 12.3260 4.0306 3.5528 4.7675 2.8134 3.8236 2.3028 5.0287 6.3562 3.9932 1.6970 2.0677 3.4698 4.1730 8.1086 3.8835 10.2612 5.2598 4.4525 1.5466 4.0108 1.4668 4.6188 1.5935 1.2668 1.4289 1.3530 1.7867 4.2232 1.2636 3.2435 1.6531 2.3841 2.5763 1.6948 1.6862 1.4706 1.7156 5.0277 3.1187 1.3245 2.0194 2.0896 1.2961 4.4597 1.2460 1.3667 1.4441 1.5515 1.1684 1.0550 1.1283 1.0479 1.4779 8.8719 7.3116 6.6933 9.0797 4.7305 1.0398 1.0383 1.0568 1.0974 1.0971 1.1071 1.0610 1.0956 1.0977 1.0948 1.0919 1.0927 1.1144 1.0749
irintensity: 0.6090 3.5006 0.7320 0.1736 1.1789 3.6215 3.4434 1.3532 0.7259 1.1412 4.2829 3.8506 0.8778 0.3884 0.0940 0.7922 1.2284 18.3322 0.8771 9.2788 1.1289 0.5081 0.3098 4.0099 1.4186 12.4812 10.1701 0.4102 0.8876 10.8890 45.2300 25.6050 9.9890 46.8386 20.1837 27.5882 71.1306 8.6698 23.0457 18.1610 58.0055 17.4031 27.5194 111.6009 0.1128 7.4549 67.2547 15.0964 35.7766 15.6084 19.4157 4.9255 7.5951 114.1210 3.2548 17.1885 6.0808 34.8403 553.1623 34.4618 2.2728 15.3931 18.4017 30.0339 21.2049 7.0873 112.9516 172.0530 30.4834 28.6633 22.6025 11.5379 14.9682 136.5196 79.5558 11.0765 39.9763 130.5929 1.9231 10.2769 32.4167 28.8434 15.8623 21.8525 16.3594 9.0094 17.1551 10.5101 5.2773 4.5240 5.9170 23.0061 21.1304
temp: 298.150 k
press: 1.00000 atm
elementType: 17 17 8 8 7 7 6 6 6 6 6 6 6 6 6 6 6 6 6 1 1 1 1 1 1 1 1 1 1 1 1 1 1
symmnumber: 1
zpe: 639555.2 jmol-1
zpe.correction: 0.243594 hartree
zpe.thermalcorrener: 0.264384 hartree
zpe.thermalcorrenthalpy: 0.265329 hartree
zpe.thermalcorrgfe: 0.190006 hartree
zpe.sumelectzpe: -1682.384554 hartree
zpe.sumelectthermal: -1682.363763 hartree
zpe.sumelectthermalent: -1682.362819 hartree
zpe.sumelectthermalfe: -1682.438141 hartree
dipole: 1.0157 -5.0783 3.4710
dipole: 6.2344
quadrupole: -102.6171 -132.3848 -127.0261
quadrupole: -20.1523 -0.1893 -1.5390
quadrupole: 18.0589 -11.7088 -6.3501 -20.1523 -0.1893 -1.5390
hfenergy: -1682.6281476 hartree
pointgroup: C01 [X(C13H14Cl2N2O2)]
dipole: 0.3263661 -2.1366302 1.1595711 debye
polarizability: 320.0111362|-7.7755829|200.2282749|3.4992829|5.8468169|94.9858643 unknown
InChI: InChI=1S/C13H14Cl2N2O2/c1-4-5-19-12-10(14)6-9(7-11(12)15)13(18)17-16-8(2)3/h4,6-7,17H,1,5H2,2-3H3
charge 0 multiplicity 1
33 atoms
Cl -2.898871 2.532514 0.335475
Cl -1.631246 -2.723645 -1.016776
O  -3.464227 -0.379931 -0.473516
O  2.455314 2.20229 -0.150024
N  3.022684 -0.057533 0.170026
N  4.395013 0.201349 0.197992
C  0.671846 0.560836 -0.13662
C  -2.118204 -0.073882 -0.297762
C  -0.303332 1.556538 0.118486
C  0.256209 -0.746476 -0.496801
C  -1.663667 1.231542 0.038886
C  -1.11622 -1.044408 -0.560972
C  2.119005 0.992506 -0.052007
C  -4.276566 -0.574182 0.782364
C  5.198184 -0.808182 0.468394
C  6.677198 -0.503299 0.484553
C  4.745739 -2.234346 0.757487
C  -5.718418 -0.356365 0.423727
C  -6.696159 -1.266931 0.652127
H  0.031449 2.571211 0.352059
H  0.974381 -1.525258 -0.771415
H  -4.091508 -1.598993 1.154402
H  -3.936739 0.165326 1.534178
H  2.655361 -0.99423 0.379391
H  7.215922 -1.120591 -0.260559
H  7.116543 -0.734982 1.474374
H  6.846556 0.560534 0.257818
H  4.079299 -2.284792 1.642516
H  5.612388 -2.882158 0.960878
H  4.198453 -2.673579 -0.101543
H  -5.950166 0.617026 -0.027729
H  -7.74319 -1.053916 0.411385
H  -6.47903 -2.250393 1.087307
