program: Gaussian 09
title: 000015297
version: EM64L-G09RevD.01
frameworkgroup: C1[X(C9H20O)]
method: RPBEPBE
basis: SDD
operation: Freq
keyword: #pfreq=noraman
keyword: PBEPBE/SDD
title: #p freq=noraman PBEPBE/SDD
converged: YES YES NO NO
title: Mulliken charges:
elementType: O C C C C C C C C C H H H H H H H H H H H H H H H H H H H H
charge: -0.472766 0.333728 -0.439762 -0.393146 -0.015869 -0.436729 -0.755634 -0.709868 -0.720285 -0.714135 0.188334 0.218392 0.188711 0.230286 0.182667 0.237358 0.179347 0.201622 0.235496 0.215090 0.209567 0.215716 0.206553 0.210287 0.208572 0.210013 0.216353 0.226313 0.219649 0.324141
chargesum: 0.00000
title: Mulliken charges with hydrogens summed into heavy atoms:
elementType: O C C C C C C C C C
charge: -0.148625 0.333728 -0.033037 0.025850 0.166798 -0.020024 -0.103426 -0.078032 -0.091413 -0.051820
polarizability: 1.15611179e+02 2.64729509e-01 9.86551449e+01 3.34947641e-01 2.15814376e-01 9.10111684e+01
1716.lowfreq: -14.0198 -0.0007 0.0003 0.0006 5.2748 16.9013 34.4535 55.8776 99.7730
frequency: 34.4085 55.8137 99.6848 123.2948 130.4922 191.8460 205.7074 225.7380 227.4817 249.8469 269.7233 294.0567 305.0955 334.8633 380.3057 385.9792 415.9703 458.1404 472.8963 512.3977 721.7194 750.1258 782.7411 824.2542 858.3068 909.6607 912.0999 928.7305 950.5085 965.6067 983.4315 1015.6533 1046.4756 1062.5598 1071.8164 1119.6663 1135.7107 1161.1472 1172.0537 1188.6204 1219.5434 1254.0351 1273.5443 1294.0995 1315.6029 1329.0784 1331.9015 1345.7617 1366.3758 1376.1856 1381.7329 1391.9138 1392.6220 1447.7614 1461.8604 1463.4006 1467.1191 1471.0649 1474.3495 1479.3847 1480.2379 1483.1413 1486.7956 1489.3934 2946.0040 2959.7248 2963.3376 2965.2240 2970.5856 2971.5428 2978.8577 2983.3101 3022.9332 3034.9074 3047.6610 3057.0540 3063.3280 3063.7250 3066.3081 3072.7186 3075.4558 3079.9959 3086.3439 3542.3967
redmass: 2.6305 3.0305 2.3753 1.8567 2.1373 1.1132 1.5100 1.3046 1.3476 1.4305 1.8465 1.1367 2.2759 2.2343 2.6919 2.1814 2.6259 2.3961 2.7013 2.6437 3.1975 1.3765 1.2656 2.2849 2.2146 1.6741 1.2170 1.5989 1.4089 1.6806 1.7219 1.6311 1.6809 2.2048 2.1175 1.9937 1.5056 2.2923 1.8073 2.0824 1.5139 1.2498 1.3513 1.2311 1.4398 1.6006 1.4262 1.5154 1.7216 1.2380 1.2366 1.2035 1.2184 1.0765 1.0624 1.0632 1.0450 1.0595 1.0733 1.0562 1.0551 1.0537 1.0536 1.0638 1.0831 1.0656 1.0439 1.0494 1.0379 1.0398 1.0567 1.0394 1.0956 1.0938 1.1023 1.0996 1.0993 1.0977 1.0989 1.0984 1.0990 1.1000 1.0991 1.0658
irintensity: 0.1346 0.5678 0.2480 1.2543 1.9186 0.2765 1.0543 1.5084 0.5286 1.5044 0.7508 112.0010 7.0045 5.2497 6.2847 1.2272 6.5502 3.2211 4.9422 6.6873 7.9003 4.6058 8.7394 0.8688 20.1379 5.7754 2.4860 10.0476 0.4065 1.4711 9.3097 7.9037 43.8400 5.9844 21.4993 14.3913 21.9492 9.5190 10.4020 4.9419 4.1168 3.8118 5.9245 3.8559 8.2918 12.5541 1.7020 14.1196 14.3326 30.1484 13.6471 24.1101 12.6129 2.0381 3.6366 1.6070 3.5633 4.1831 13.4981 14.0870 7.1123 8.9881 29.1314 4.1086 24.5002 37.1542 20.5609 65.3626 35.8294 8.7591 25.4467 33.8311 2.9974 14.1770 36.4480 13.0545 43.5588 37.1142 104.2514 54.0864 54.4976 57.0544 33.0793 5.2491
temp: 298.150 k
press: 1.00000 atm
elementType: 8 6 6 6 6 6 6 6 6 6 1 1 1 1 1 1 1 1 1 1 1 1 1 1 1 1 1 1 1 1
symmnumber: 1
zpe: 713949.0 jmol-1
zpe.correction: 0.271929 hartree
zpe.thermalcorrener: 0.285662 hartree
zpe.thermalcorrenthalpy: 0.286606 hartree
zpe.thermalcorrgfe: 0.232272 hartree
zpe.sumelectzpe: -429.317708 hartree
zpe.sumelectthermal: -429.303974 hartree
zpe.sumelectthermalent: -429.303030 hartree
zpe.sumelectthermalfe: -429.357364 hartree
dipole: -1.5595 0.8515 -0.5563
dipole: 1.8619
quadrupole: -60.9989 -67.5381 -65.4697
quadrupole: 0.7624 -2.3428 0.6923
quadrupole: 3.6700 -2.8692 -0.8008 0.7624 -2.3428 0.6923
hfenergy: -429.5896364 hartree
pointgroup: C01 [X(C9H20O1)]
dipole: -0.6146348 -0.3347784 0.2161626 debye
polarizability: 115.6088985|-0.320349|98.6527852|-0.3458754|0.2841224|91.015809 unknown
InChI: InChI=1S/C9H20O/c1-5-9(4,10)7-6-8(2)3/h8,10H,5-7H2,1-4H3
charge 0 multiplicity 1
30 atoms
O  -1.303933 1.341794 -1.293124
C  -1.519531 0.479154 -0.091111
C  -0.123601 0.411731 0.576184
C  0.978566 -0.256801 -0.273892
C  2.390394 -0.212655 0.373272
C  -2.052122 -0.897155 -0.578709
C  -2.528108 1.182719 0.844881
C  2.946574 1.229112 0.472318
C  3.370179 -1.110838 -0.419546
C  -2.218731 -1.971822 0.518597
H  -0.218775 -0.114361 1.547569
H  0.165629 1.455135 0.804543
H  0.71482 -1.319669 -0.452907
H  1.011475 0.235458 -1.2655
H  2.30774 -0.621331 1.404572
H  -1.3689 -1.267767 -1.365581
H  -3.034082 -0.729698 -1.071935
H  -3.525157 1.262035 0.368766
H  -2.17354 2.202659 1.076476
H  -2.651902 0.635776 1.797225
H  3.015773 1.685589 -0.533971
H  2.30704 1.880837 1.09446
H  3.959577 1.231016 0.91703
H  3.015598 -2.158292 -0.457374
H  3.469714 -0.750565 -1.461963
H  4.378209 -1.107803 0.03614
H  -2.597191 -2.914806 0.083538
H  -1.255456 -2.195103 1.012224
H  -2.93484 -1.654368 1.298108
H  -2.169618 1.431422 -1.769092
