program: Gaussian 09
title: 000212216
version: EM64L-G09RevD.01
frameworkgroup: C1[X(C11H14Cl2N2O2)]
method: RPBEPBE
basis: SDD
operation: Freq
keyword: #p
keyword: freq=noraman
keyword: PBEPBE/SDD
title: #p freq=noraman PBEPBE/SDD
converged: YES YES NO NO
title: Mulliken charges:
elementType: Cl Cl O O N N C C C C C C C C C C C H H H H H H H H H H H H H H
charge: -0.018598 -0.015113 -0.259550 -0.267708 -0.400575 -0.499085 -0.363987 -0.341663 -0.282668 0.555279 -0.686144 -0.281026 -0.266283 0.353803 -0.371864 -0.394871 0.138769 0.214750 0.213477 0.194944 0.196095 0.214309 0.216090 0.213236 0.213897 0.218041 0.256553 0.300805 0.332534 0.306153 0.310398
chargesum: 0.00000
title: Mulliken charges with hydrogens summed into heavy atoms:
elementType: Cl Cl O O N N C C C C C C C C C C C
charge: -0.018598 -0.015113 -0.259550 -0.267708 -0.068041 0.117466 0.064241 0.049376 0.147731 0.555279 -0.040969 -0.281026 -0.266283 0.353803 -0.115311 -0.094066 0.138769
polarizability: 2.43808607e+02 1.30580368e+00 1.71423289e+02 9.67645912e+00 -1.75021043e+00 8.99542725e+01
1716.lowfreq: -16.3207 -3.8025 -0.0014 -0.0010 0.0026 4.8944 13.1687 19.1353 27.2324
frequency: 9.4619 15.0418 27.0904 46.2163 80.6607 95.3918 98.8708 104.1105 106.1846 131.6905 154.7965 181.7904 201.8652 204.7195 236.3541 241.6782 264.9314 272.6365 324.3415 341.7640 364.0048 396.5285 436.1487 483.4055 505.5121 531.2478 572.1588 585.6957 671.1880 733.6947 739.8962 746.7671 756.6240 777.3519 798.1855 803.7354 877.1292 897.5514 907.2777 917.3108 923.9936 933.3058 1037.5205 1049.4733 1076.8577 1082.0314 1122.3562 1136.9611 1183.1297 1195.0654 1209.5321 1235.3631 1272.0431 1275.3044 1282.4739 1284.9279 1289.1422 1342.8876 1343.4194 1370.5387 1385.0720 1392.3254 1431.7352 1465.0367 1469.5416 1472.3779 1478.2665 1480.5479 1490.1521 1536.5287 1593.0449 1597.7813 1680.2639 2967.9367 2974.3277 2977.2493 2998.0838 3012.7722 3032.6546 3065.7103 3077.1716 3077.6000 3159.9778 3174.4584 3389.3868 3505.2180 3558.5518
redmass: 3.3564 2.1905 5.6686 7.3778 2.5222 5.4796 2.4463 6.2157 3.8293 1.2604 5.4427 6.4278 3.9423 4.7684 1.1070 7.8614 5.1136 6.9993 7.1802 9.5515 4.7923 6.4733 4.1850 7.2754 4.8676 2.4481 1.8613 3.5188 8.4199 5.7796 1.0799 5.6586 7.5361 1.6968 5.5062 1.1675 1.5161 3.5040 2.5955 1.6138 4.7100 1.1676 3.4572 3.4465 3.4940 2.2309 2.5892 1.3799 2.0719 1.8775 1.4023 3.7670 1.3466 1.1767 1.9809 1.0749 1.3580 1.4886 4.3707 1.5080 4.9076 1.2154 2.0487 2.1357 1.0871 1.1360 1.0421 1.0847 1.0922 8.8883 7.2038 8.6525 1.0611 1.0583 1.0557 1.0367 1.0589 1.1005 1.1066 1.1050 1.1017 1.1002 1.0922 1.0927 1.0429 1.0986 1.0792
irintensity: 1.6977 0.2844 0.4791 2.3751 1.4629 1.9612 0.1221 0.6049 1.1803 23.8414 2.5133 1.0391 4.2971 0.3211 0.0099 0.8795 7.1442 11.8651 20.4116 8.8708 8.3549 1.7823 9.3563 8.3640 2.5530 44.8162 98.2675 20.5325 21.5554 9.5652 4.8322 36.1637 74.1695 132.9299 33.1150 2.2663 11.5792 31.1005 2.4799 20.9685 91.5514 1.3298 22.2087 26.5763 2.7800 9.0132 3.1049 2.9372 3.9715 2.9277 1.0461 168.6834 0.5753 0.1046 211.5562 0.5348 60.6829 0.4018 11.4119 45.8522 10.9140 4.8604 237.6246 62.0613 1.6283 3.9748 12.7311 5.4004 16.8965 92.6964 10.3061 114.8655 30.3232 15.6148 44.2101 35.8133 40.6711 10.0062 2.6817 4.7553 86.9249 61.6842 1.8541 4.8893 1.5883 2.8177 33.9104
temp: 298.150 k
press: 1.00000 atm
elementType: 17 17 8 8 7 7 6 6 6 6 6 6 6 6 6 6 6 1 1 1 1 1 1 1 1 1 1 1 1 1 1
symmnumber: 1
zpe: 620449.8 jmol-1
zpe.correction: 0.236317 hartree
zpe.thermalcorrener: 0.255493 hartree
zpe.thermalcorrenthalpy: 0.256437 hartree
zpe.thermalcorrgfe: 0.184236 hartree
zpe.sumelectzpe: -1606.322074 hartree
zpe.sumelectthermal: -1606.302898 hartree
zpe.sumelectthermalent: -1606.301953 hartree
zpe.sumelectthermalfe: -1606.374155 hartree
dipole: -0.6719 1.7067 1.0232
dipole: 2.1003
quadrupole: -102.9246 -119.2829 -116.3190
quadrupole: 6.5360 -5.3165 3.0111
quadrupole: 9.9175 -6.4407 -3.4768 6.5360 -5.3165 3.0111
hfenergy: -1606.5583908 hartree
pointgroup: C01[X(C11H14Cl2N2O2)]
dipole: 0.2628786 0.3454945 -0.7030814 debye
polarizability: 243.0174704|8.3443197|148.4791186|12.1573518|-36.4241585|113.6895796 unknown
InChI: InChI=1S/C11H14Cl2N2O2/c1-2-3-4-17-10-8(12)5-7(6-9(10)13)11(16)15-14/h5-6,15H,2-4,14H2,1H3
charge 0 multiplicity 1
31 atoms
Cl 0.499123 2.337115 -1.416378
Cl 1.003308 -2.167083 1.819086
O  1.929404 0.390559 0.425194
O  -4.095767 -1.991613 -0.016292
N  -4.515337 0.22353 -0.572539
N  -5.917264 0.034367 -0.710346
C  4.31316 0.15109 0.020581
C  5.44719 -0.471803 -0.828163
C  2.932204 -0.283681 -0.464825
C  0.595566 0.068216 0.201932
C  6.846241 -0.03939 -0.338651
C  -0.241661 0.904166 -0.583107
C  -0.021486 -1.060886 0.807305
C  -2.198413 -0.467556 -0.107301
C  -1.616036 0.658538 -0.742589
C  -1.388008 -1.337918 0.66193
C  -3.658408 -0.818866 -0.229449
H  4.427937 -0.144195 1.080756
H  4.375191 1.25538 -0.017158
H  5.320433 -0.178264 -1.890039
H  5.370438 -1.577688 -0.796061
H  2.742343 0.039187 -1.507712
H  2.798702 -1.38054 -0.386123
H  6.961028 1.059504 -0.388169
H  7.011147 -0.347401 0.710653
H  7.644934 -0.491684 -0.954127
H  -2.19965 1.317477 -1.392226
H  -1.847336 -2.21607 1.124336
H  -4.210136 1.197089 -0.573493
H  -6.120532 -0.513821 -1.558438
H  -6.292714 -0.446762 0.120714
