program: Gaussian 09
title: 000211946
version: EM64L-G09RevD.01
frameworkgroup: C1[X(C25H27FNOS)]
method: RPBEPBE
basis: SDD
operation: Freq
keyword: #p
keyword: freq=noraman
keyword: PBEPBE/SDD
title: #p freq=noraman PBEPBE/SDD
converged: YES YES NO NO
title: Mulliken charges:
elementType: S F O N C C C C C C C C C C C C C C C C C C C C C C C C C H H H H H H H H H H H H H H H H H H H H H H H H H H H
charge: 0.179340 -0.184677 -0.286284 -0.089103 -0.339396 -0.540641 -0.583998 -0.582290 -0.346682 -0.398906 0.520899 0.429649 0.647030 0.413325 -0.512756 -0.403060 -0.404617 -0.912152 -0.429624 -0.450224 -0.400467 0.349710 -0.188782 -0.266850 -0.231335 -0.225493 -0.239010 -0.371843 -0.231694 0.316496 0.253531 0.274933 0.274984 0.308642 0.245266 0.298657 0.263182 0.266159 0.283964 0.220407 0.254704 0.208689 0.276301 0.242850 0.288764 0.297259 0.230043 0.236866 0.244618 0.256669 0.264548 0.244601 0.247074 0.241343 0.283887 0.255493
chargesum: 1.00000
title: Mulliken charges with hydrogens summed into heavy atoms:
elementType: S F O N C C C C C C C C C C C C C C C C C C C C C C C C C
charge: 0.179340 -0.184677 -0.286284 -0.089103 0.230631 0.009277 0.268567 0.231017 0.128429 -0.190216 0.520899 0.429649 0.647030 0.413325 -0.236455 -0.160210 -0.404617 -0.326129 -0.199581 -0.213358 -0.155849 0.349710 0.067887 -0.002302 0.013266 0.021581 0.002333 -0.087956 0.023799
polarizability: 3.21331124e+02 3.29476547e+01 2.53832990e+02 1.70933780e+01 4.70208551e+00 2.69689040e+02
1716.lowfreq: -7.2581 -0.0013 -0.0011 0.0008 3.5244 5.8692 13.8245 22.1965 30.3382
frequency: 13.1295 22.0434 30.2793 44.6700 53.3816 68.9690 80.5619 89.6410 99.6541 106.2764 137.4131 154.2951 171.7803 201.0523 212.7734 234.0628 238.7768 259.9191 263.4424 274.4225 284.6248 297.9856 302.1341 324.0963 340.6101 353.0881 370.2625 376.0369 404.8682 415.1128 423.5460 437.9394 439.9675 453.3522 457.2571 471.9155 504.0056 512.2231 524.1696 546.2671 555.6374 578.1602 617.4165 621.9621 635.8263 641.2201 660.6694 674.9627 703.9334 728.9631 746.7869 758.5067 761.5719 768.9612 786.3409 792.6197 815.1117 826.6427 844.2825 857.2636 865.5977 875.5857 882.5906 895.2387 901.2695 912.9582 915.5879 932.8772 943.5325 955.0318 959.7350 972.9361 987.2565 989.9087 994.5996 1000.0578 1003.7345 1027.9059 1040.7640 1043.5760 1054.3596 1059.8444 1088.4135 1098.9192 1107.0292 1127.1782 1138.6407 1149.9160 1166.8445 1172.2198 1180.2099 1181.9825 1183.3631 1185.6811 1200.8183 1206.4581 1221.4784 1246.1433 1250.8513 1256.2972 1262.8178 1265.2315 1292.6446 1303.6707 1319.7304 1329.4405 1340.0977 1355.6101 1367.5105 1371.3655 1378.8569 1390.3909 1393.0210 1413.7885 1420.0789 1436.6486 1439.4722 1442.5238 1444.8799 1448.4117 1450.3506 1460.3682 1463.7551 1466.7386 1468.8513 1479.6293 1488.9565 1491.6670 1493.7475 1568.1194 1591.7597 1594.2818 1596.5723 1610.6681 1615.9269 2960.8828 2983.7059 3018.4518 3023.8633 3025.4691 3028.7858 3046.8584 3054.6311 3097.2690 3106.2536 3109.2971 3119.9302 3124.0680 3133.2402 3133.4354 3133.4493 3135.2689 3148.1839 3149.1887 3150.9475 3152.5944 3160.5083 3163.7683 3166.3632 3171.8212 3173.0310 3186.1357
redmass: 6.3295 6.3930 6.0149 6.1736 6.1570 4.6780 4.1458 4.1681 4.8714 4.0093 4.3108 4.0070 3.7506 6.4637 2.0586 4.6689 1.8792 1.8069 4.7435 2.8311 2.7384 1.6892 5.0633 4.0352 4.0669 3.2006 3.2897 3.4296 2.7295 2.7342 3.0313 2.3313 2.9931 3.3248 3.3146 3.6754 8.6983 4.2463 3.5611 3.9547 3.5015 5.2391 5.7309 4.5966 5.3371 6.0015 6.1060 3.4277 2.6666 4.5819 4.9039 1.6650 2.2829 1.6399 2.5191 2.1669 2.1856 2.8870 3.5136 2.6876 2.2823 1.6517 1.8350 2.0644 1.4835 1.7510 1.7933 2.7329 2.3626 1.3971 1.4095 2.3313 1.8361 2.7384 1.3302 1.3458 2.2345 6.1948 2.2947 2.4148 2.4064 2.3185 1.5361 1.3433 1.8684 1.7833 1.7114 1.7924 1.1250 1.9277 1.3182 1.0709 1.2028 1.2498 1.5832 2.0151 1.6865 1.4360 3.1875 1.3776 1.3399 1.2570 1.5292 1.2769 1.2892 1.7015 1.2718 1.3353 1.4380 1.4811 2.2037 4.7384 7.1195 1.1365 2.0264 1.2229 1.3984 2.3050 1.4607 1.1596 1.0951 1.1454 1.9563 1.0770 1.1104 2.3784 2.6882 1.0570 1.0707 6.3800 6.0383 6.5725 6.3752 6.4248 6.7654 1.0663 1.0854 1.0617 1.0375 1.0494 1.0397 1.0590 1.0956 1.1073 1.0890 1.1019 1.0894 1.1055 1.0892 1.0896 1.0892 1.1043 1.1050 1.1041 1.0921 1.0925 1.0975 1.0995 1.0924 1.1004 1.1005 1.0986
irintensity: 0.2345 0.1283 0.3333 0.4134 1.4512 2.4078 0.7431 2.6443 1.3005 3.9377 1.4568 3.3422 4.4401 2.4984 0.4973 0.9703 0.7482 1.0774 2.4977 0.5367 3.1896 2.4878 3.3036 2.9562 1.7322 3.8010 2.3433 0.0449 1.3232 0.6504 1.0109 0.0686 1.7048 9.5673 3.6060 6.7356 3.2456 0.6037 1.7897 0.5763 2.6319 2.4333 11.1704 12.4601 25.9290 12.8096 12.6779 1.2720 19.2355 0.1999 12.3175 143.9708 19.9969 18.6182 37.4118 123.4587 1.2929 13.8214 15.0021 4.8222 5.2843 2.5679 34.5613 32.2457 13.2621 11.0053 8.3416 27.0647 24.4714 0.2508 0.5507 22.2682 2.1465 1.3444 0.0942 0.0920 4.2039 31.5179 64.3651 0.5985 2.9283 24.3707 8.4971 1.1734 4.0802 1.3362 4.5727 27.1678 3.5899 9.9543 6.6403 0.3767 1.1060 4.3054 0.8219 16.9593 2.9877 7.3501 58.7714 21.5659 0.9477 2.7554 5.6053 3.6279 5.2825 1.6397 19.6417 8.4530 11.8532 6.1499 1.1270 0.7918 2.1014 14.8522 16.2799 13.9995 11.2976 40.1082 6.6217 20.5554 21.7663 1.3699 38.9055 10.1306 13.9577 18.9999 7.8452 58.8343 62.9280 6.3136 13.6146 5.1537 45.4241 2.6559 6.5211 31.9493 17.6285 18.5309 1.4746 5.7843 22.3787 10.9443 20.1450 2.1269 8.0265 0.9597 8.7251 1.7544 2.3306 2.4370 2.8478 4.1904 1.6493 3.0908 5.2742 11.3456 1.9823 3.9070 3.4323 12.4106 17.4173 0.2305
temp: 298.150 k
press: 1.00000 atm
elementType: 16 9 8 7 6 6 6 6 6 6 6 6 6 6 6 6 6 6 6 6 6 6 6 6 6 6 6 6 6 1 1 1 1 1 1 1 1 1 1 1 1 1 1 1 1 1 1 1 1 1 1 1 1 1 1 1
symmnumber: 1
zpe: 1207422.2 jmol-1
zpe.correction: 0.459883 hartree
zpe.thermalcorrener: 0.486115 hartree
zpe.thermalcorrenthalpy: 0.487059 hartree
zpe.thermalcorrgfe: 0.402683 hartree
zpe.sumelectzpe: -1594.382195 hartree
zpe.sumelectthermal: -1594.355963 hartree
zpe.sumelectthermalent: -1594.355019 hartree
zpe.sumelectthermalfe: -1594.439395 hartree
dipole: -5.8170 8.7510 -2.3413
dipole: 10.7656
quadrupole: -125.5397 -141.4702 -152.2357
quadrupole: -13.6392 6.3191 8.3575
quadrupole: 14.2088 -1.7217 -12.4871 -13.6392 6.3191 8.3575
hfenergy: -1594.8420776 hartree
pointgroup: C01 [X(C25H27F1N1O1S1)]
dipole: -3.4916431 0.4521457 -2.3545103 debye
polarizability: 264.5642242|39.1064686|317.9398632|-11.0471139|-1.8723457|262.3490669 unknown
InChI: InChI=1S/C25H27FNOS/c1-27(2,17-19-8-7-10-21(26)16-19)14-15-28-25-22-11-4-3-9-20(22)18-29-24-13-6-5-12-23(24)25/h3-13,16,25H,14-15,17-18H2,1-2H3
charge 1 multiplicity 1
56 atoms
S  1.393833 1.679513 2.030786
F  -2.356516 -3.652309 2.780072
O  0.396229 1.609687 -1.460188
N  -2.643699 0.788232 -0.753163
C  -1.678727 0.174704 -1.791919
C  -3.824537 -0.223126 -0.479346
C  -1.908593 1.09403 0.552569
C  -3.272566 2.073502 -1.279616
C  -0.618017 1.124689 -2.388429
C  1.599623 0.69887 -1.28431
C  -3.408124 -1.63642 -0.137553
C  2.862109 1.537494 -1.15576
C  1.391159 -0.30315 -0.150534
C  3.005295 2.56636 -0.17977
C  -3.068387 -1.990236 1.194023
C  -3.416073 -2.640968 -1.142151
C  1.338146 0.021605 1.23788
C  1.839061 2.962143 0.682229
C  3.958397 1.219126 -1.992105
C  1.294057 -1.675659 -0.519338
C  4.245195 3.237614 -0.059369
C  -2.709781 -3.320211 1.466141
C  -3.068975 -3.974293 -0.8296
C  1.18591 -1.019181 2.195965
C  5.191249 1.896943 -1.867531
C  5.336399 2.90916 -0.893928
C  1.132293 -2.703127 0.430055
C  -2.701904 -4.328934 0.487366
C  1.074949 -2.366602 1.803025
H  -1.197645 -0.6846 -1.299613
H  -2.316881 -0.199399 -2.6141
H  -4.435841 -0.204385 -1.397891
H  -4.399328 0.243941 0.338979
H  -1.075724 1.777023 0.339481
H  -2.622762 1.546866 1.258648
H  -1.497708 0.161454 0.961221
H  -3.680908 1.897605 -2.287095
H  -4.08315 2.375048 -0.597999
H  -2.514106 2.868107 -1.311777
H  -0.148751 0.563987 -3.225264
H  -1.07944 2.027277 -2.826637
H  1.684271 0.117684 -2.224764
H  -3.096519 -1.268211 2.016463
H  -3.717937 -2.390223 -2.165965
H  2.062778 3.853204 1.290709
H  0.93436 3.135991 0.084241
H  3.854376 0.427482 -2.744306
H  1.374383 -1.938674 -1.582591
H  4.355125 4.027192 0.692837
H  -3.093398 -4.742782 -1.607904
H  1.169999 -0.763867 3.26172
H  6.028222 1.637155 -2.523502
H  6.287291 3.441136 -0.787663
H  1.072215 -3.748001 0.10948
H  -2.435094 -5.354521 0.757546
H  0.965368 -3.145042 2.564944
