program: Gaussian 09
title: 000211938
version: EM64L-G09RevD.01
frameworkgroup: C1[X(C20H24N2O2)]
method: RPBEPBE
basis: SDD
operation: Freq
keyword: #p
keyword: freq=noraman
keyword: PBEPBE/SDD
title: #p freq=noraman PBEPBE/SDD
converged: YES YES NO NO
title: Mulliken charges:
elementType: O O N N C C C C C C C C C C C C C C C C C C C C H H H H H H H H H H H H H H H H H H H H H H H H
charge: -0.294863 -0.224188 -0.078995 -0.162452 -0.353635 -0.374792 -0.423327 -0.389327 -0.351479 0.322305 -0.539897 0.210464 -0.350440 0.119949 -0.345925 -0.261364 0.280910 -0.262043 -0.339634 -0.345896 -0.537296 -0.249000 -0.230610 -0.223710 0.188850 0.195425 0.208255 0.194539 0.198706 0.221576 0.251306 0.200665 0.193863 0.234687 0.237508 0.252977 0.244823 0.234165 0.219759 0.222047 0.247441 0.277875 0.218067 0.240786 0.224555 0.230523 0.233394 0.233452
chargesum: 0.00000
title: Mulliken charges with hydrogens summed into heavy atoms:
elementType: O O N N C C C C C C C C C C C C C C C C C C C C
charge: -0.294863 -0.224188 -0.078995 -0.162452 0.030640 0.028002 -0.003045 0.062644 0.077071 0.322305 -0.049412 0.210464 -0.105616 0.119949 -0.111761 -0.041605 0.280910 -0.039996 -0.092194 -0.068021 0.146112 -0.018477 0.002784 0.009742
polarizability: 3.49884874e+02 1.04917590e+00 2.50662063e+02 1.86781172e+00 3.62024189e+00 1.26576529e+02
1716.lowfreq: -9.2090 -0.0007 0.0004 0.0007 1.8689 13.0224 16.5349 18.9614 29.4781
frequency: 15.0362 18.8886 28.8742 44.8366 61.8845 66.2761 91.6986 99.4671 106.3408 139.5188 156.4330 164.4716 178.2445 216.0805 227.1137 250.3995 272.8370 289.5420 297.4125 318.1248 330.4640 353.7411 390.8215 400.3374 415.5294 416.6892 467.8468 475.9132 494.2347 506.5595 528.5093 559.2935 569.5161 572.8524 613.0579 618.8201 650.7329 697.0483 701.1410 726.9209 741.5498 750.1505 757.1641 769.7053 805.1629 820.5821 831.8794 851.3878 859.3726 902.7859 920.9886 941.8001 949.3876 955.9622 977.0312 985.3769 989.8435 990.7895 1009.5567 1011.1752 1026.9191 1036.7938 1051.9886 1054.4466 1060.0412 1081.6829 1089.1818 1097.0855 1113.0996 1115.7772 1132.2668 1147.0886 1152.2771 1168.9188 1173.0231 1173.8655 1188.6301 1195.8041 1202.6005 1204.2712 1224.6848 1243.1411 1261.1045 1285.9496 1288.4562 1301.0722 1305.7871 1320.4567 1342.4120 1350.4221 1358.5477 1369.0366 1380.9883 1387.2334 1387.4977 1396.3274 1430.3059 1433.5079 1436.5831 1443.5218 1454.1389 1456.7426 1462.4500 1465.6218 1466.7876 1474.8831 1475.5084 1479.6396 1502.3063 1569.0664 1580.8658 1598.4130 1604.3867 1612.3934 2852.5903 2868.0154 2881.4087 2894.2408 2916.0771 2957.2919 2973.7616 3022.3106 3030.9583 3034.3947 3044.5704 3047.5615 3052.5335 3106.4908 3118.9831 3128.2525 3128.5793 3137.9697 3144.6340 3149.3550 3158.2737 3158.4801 3169.0066 3169.8298
redmass: 5.1025 4.7165 4.3327 5.3000 4.6883 3.1136 3.6291 2.9021 3.2952 5.0521 4.3851 4.3280 2.7751 2.6076 3.2462 1.5766 1.9228 2.9970 3.9387 4.3780 2.8245 3.5345 2.4128 2.8105 3.4255 3.2826 3.1219 3.3875 4.0362 5.5617 4.1474 4.1740 2.7531 3.1695 6.3513 3.5230 4.4908 1.8252 3.5376 3.8822 1.3159 3.5408 1.5524 5.1185 1.9305 2.4482 1.5617 1.5441 1.2479 1.3820 3.9472 1.5031 2.0180 1.3932 3.5917 8.3480 6.2058 1.3798 1.4252 2.4450 2.0683 1.8938 2.0996 1.8828 2.2918 1.8870 2.1832 2.1879 1.2597 1.9339 2.5023 2.8752 1.4446 1.9481 1.0719 1.0870 1.1267 1.5063 2.5731 1.3438 2.1330 1.5644 1.3147 1.4865 1.2523 1.4877 1.6638 1.3942 1.3546 1.4494 1.6295 1.5059 1.9734 6.3139 3.1822 1.4850 1.6161 1.3088 1.7155 1.4655 1.0856 1.1222 1.1045 1.0975 1.0523 1.0851 1.1473 2.0297 2.6260 6.7999 6.4611 6.7589 6.4105 6.4550 1.0709 1.0703 1.0703 1.0689 1.0712 1.0328 1.0598 1.0953 1.0885 1.0905 1.1038 1.0899 1.0907 1.0895 1.0993 1.0850 1.0847 1.0880 1.0893 1.0924 1.0929 1.0960 1.1013 1.0996
irintensity: 1.5416 0.2971 0.3875 0.3631 2.3098 0.2670 5.7135 1.2292 2.8336 2.0868 0.5345 0.4634 2.5954 10.3541 2.3776 5.6334 0.5864 3.0775 5.3045 3.7595 4.8235 5.4624 0.7459 0.0910 0.3064 1.5949 4.7291 4.1005 4.2840 1.1113 7.5560 0.7523 3.1601 6.0650 0.1036 1.6053 17.4013 47.8334 10.2645 2.1785 86.8167 29.6566 56.0452 4.4558 7.6045 6.6372 2.0388 0.1932 0.6182 4.0868 15.7220 6.3124 22.0915 5.6287 81.0645 54.7616 5.9076 0.5184 5.4470 26.5428 7.3894 1.7518 21.2221 2.2815 13.9134 7.1365 4.5223 8.8751 0.1110 38.3252 67.8556 33.1726 4.3530 21.8424 4.3943 1.4652 28.2572 35.3652 61.5805 55.4966 31.8499 177.8160 64.1452 5.1883 5.9077 16.9631 125.0477 31.7553 25.3211 25.0406 4.8872 14.6824 58.7528 8.9350 11.7348 10.6742 8.9431 10.5386 27.4851 22.0287 1.2925 13.5262 37.4682 20.9503 9.2093 38.0812 15.0168 1.2962 147.5165 94.1734 8.3067 38.6250 84.6016 10.6255 54.9937 30.9472 104.4592 84.1362 122.8778 75.7590 29.4028 9.6230 44.4101 54.2306 45.0121 26.7924 32.3110 6.9451 21.0634 0.3028 2.8008 5.8883 18.4014 18.8162 35.1088 22.4490 23.4686 15.0018
temp: 298.150 k
press: 1.00000 atm
elementType: 8 8 7 7 6 6 6 6 6 6 6 6 6 6 6 6 6 6 6 6 6 6 6 6 1 1 1 1 1 1 1 1 1 1 1 1 1 1 1 1 1 1 1 1 1 1 1 1
symmnumber: 1
zpe: 1047430.7 jmol-1
zpe.correction: 0.398945 hartree
zpe.thermalcorrener: 0.421202 hartree
zpe.thermalcorrenthalpy: 0.422147 hartree
zpe.thermalcorrgfe: 0.344801 hartree
zpe.sumelectzpe: -1034.666408 hartree
zpe.sumelectthermal: -1034.644151 hartree
zpe.sumelectthermalent: -1034.643207 hartree
zpe.sumelectthermalfe: -1034.720552 hartree
dipole: 0.2494 1.6339 -0.1033
dipole: 1.6561
quadrupole: -114.6029 -134.5401 -148.5223
quadrupole: 24.3211 0.7943 -0.9748
quadrupole: 17.9522 -1.9850 -15.9672 24.3211 0.7943 -0.9748
hfenergy: -1035.0653534 hartree
pointgroup: C01 [X(C20H24N2O2)]
dipole: -0.0949194 -0.6394762 -0.0811499 debye
polarizability: 349.8312227|1.7830355|250.6322229|-3.383725|4.3295485|126.6600202 unknown
InChI: InChI=1S/C20H24N2O2/c1-24-20-10-6-5-9-18(20)22-15-13-21(14-16-22)12-11-19(23)17-7-3-2-4-8-17/h2-10H,11-16H2,1H3
charge 0 multiplicity 1
48 atoms
O  4.747623 1.685492 0.010313
O  -4.017111 2.225017 0.0062
N  -0.133556 0.515637 0.343218
N  2.669756 -0.183669 0.032983
C  0.325957 -0.39011 -0.737948
C  0.944334 1.487976 0.665214
C  1.607516 -1.140909 -0.329879
C  2.225427 0.758463 1.093031
C  -1.411658 1.200012 0.027336
C  4.018342 -0.621863 0.00488
C  -2.609351 0.235405 0.075114
C  5.108076 0.320151 -0.011324
C  4.358494 -2.001466 -0.078135
C  -3.957209 0.959395 0.03887
C  6.446654 -0.120694 -0.079053
C  5.699049 -2.439362 -0.169649
C  -5.218602 0.13771 0.05194
C  6.749381 -1.501414 -0.161308
C  -5.206017 -1.281108 0.134803
C  -6.466839 0.815161 -0.016285
C  5.819023 2.673016 -0.120883
C  -6.416982 -2.005936 0.14838
C  -7.675145 0.091605 -0.004166
C  -7.653363 -1.32229 0.07822
H  0.527541 0.178307 -1.682302
H  -0.460944 -1.136938 -0.950959
H  0.599327 2.13151 1.495842
H  1.179801 2.144271 -0.210063
H  1.366118 -1.828903 0.515649
H  1.946351 -1.749843 -1.186907
H  3.023062 1.491821 1.277563
H  2.02297 0.197033 2.034464
H  -1.381999 1.71467 -0.965188
H  -1.573047 1.991841 0.780295
H  -2.577214 -0.492105 -0.760088
H  -2.540889 -0.364318 1.005867
H  3.559861 -2.74871 -0.050938
H  7.264062 0.606757 -0.090855
H  5.914093 -3.511781 -0.231802
H  7.793072 -1.827342 -0.221369
H  -4.256453 -1.823305 0.193646
H  -6.455173 1.908643 -0.076831
H  6.520421 2.630681 0.735592
H  5.309359 3.648164 -0.133301
H  6.380109 2.532776 -1.065295
H  -6.399379 -3.099308 0.214211
H  -8.632121 0.622129 -0.057677
H  -8.592827 -1.886366 0.088275
