program: Gaussian 09
title: 000211897
version: EM64L-G09RevD.01
frameworkgroup: C1[X(C12H9ClN2O2)]
method: RPBEPBE
basis: SDD
operation: Freq
keyword: #p
keyword: freq=noraman
keyword: PBEPBE/SDD
title: #p freq=noraman PBEPBE/SDD
converged: YES YES NO NO
title: Mulliken charges:
elementType: Cl O O N N C C C C C C C C C C C C H H H H H H H H H
charge: -0.034826 -0.270632 -0.253863 -0.000427 0.006106 -0.472003 0.452846 0.236965 -0.294822 0.226391 -0.460827 -0.196078 -0.186618 -0.400722 -0.059127 -0.322107 -0.328342 0.230341 0.249020 0.282298 0.250073 0.303491 0.236656 0.286846 0.247049 0.272316
chargesum: 0.00000
title: Mulliken charges with hydrogens summed into heavy atoms:
elementType: Cl O O N N C C C C C C C C C C C C
charge: -0.034826 -0.270632 -0.253863 -0.000427 0.006106 0.007358 0.452846 0.236965 -0.012525 0.226391 -0.210755 0.107413 0.050037 -0.113876 -0.059127 -0.075058 -0.056026
polarizability: 1.97317881e+02 5.13052924e+00 1.62981007e+02 3.30454572e+00 1.39224195e+01 1.03889891e+02
1716.lowfreq: -10.9269 -3.3009 0.0009 0.0010 0.0025 7.4051 17.8771 26.6875 40.6967
frequency: 17.6110 26.6711 40.6885 72.3527 104.3735 125.5137 173.5336 188.6278 220.3136 253.9581 294.3181 341.9539 360.7514 384.5216 404.6402 434.8970 461.0999 470.5647 510.3320 600.9849 626.4485 632.1876 691.0974 707.9562 723.3686 729.9200 788.7954 809.9832 837.9750 876.6609 898.9696 929.9341 937.7262 953.7107 957.9664 972.0840 995.0928 1000.6615 1010.3476 1027.8440 1046.5594 1086.8637 1121.1373 1154.5646 1196.3679 1228.2043 1235.9089 1240.8159 1298.4453 1310.9930 1312.3088 1343.0636 1354.3780 1404.8799 1418.7359 1420.3377 1457.0143 1460.7131 1530.3978 1558.2336 1572.2171 1587.3865 1619.9190 3039.6608 3113.2647 3117.3231 3134.7016 3150.2765 3155.4589 3163.5046 3171.1327 3190.3989
redmass: 7.1594 7.3362 5.2584 9.5699 6.6295 6.3798 5.4739 4.0206 7.6460 7.1425 5.1978 4.1871 4.2542 3.4381 3.9875 4.7557 5.1022 5.9031 5.5514 6.8736 7.1391 7.8357 3.8508 6.3307 2.0573 3.3280 3.2776 6.2247 2.2989 6.1273 1.6190 1.4442 1.3667 1.5020 1.4900 1.9213 5.1754 1.4261 3.5660 3.0870 5.8159 2.0994 1.5784 2.1478 1.4553 2.0673 1.8964 1.4396 1.3708 8.3752 6.6284 1.2169 1.2788 2.1734 2.1372 2.6432 1.2725 1.7841 6.9125 5.5833 6.4779 5.8233 10.6983 1.0590 1.0938 1.1051 1.0889 1.0922 1.0920 1.0942 1.1002 1.0941
irintensity: 0.6619 0.9653 2.0242 1.3120 1.4811 0.6544 1.7302 0.5753 6.1165 1.9801 2.1508 8.4468 2.7449 3.3052 3.5179 1.3645 3.2154 4.2629 15.1669 5.6667 6.5731 4.1279 4.6786 29.2501 23.1836 44.1253 25.7122 22.1939 42.2729 81.0260 19.9987 0.4195 3.9421 4.5762 0.5698 0.2140 99.1895 3.4631 4.9464 1.0056 198.3115 20.7115 10.7986 32.7081 0.8998 313.9121 44.1282 27.4593 14.3546 5.3889 4.3246 3.2961 21.6693 38.9408 24.5542 2.4090 21.2748 15.6229 44.1399 5.9204 26.2617 6.7646 143.2077 28.0365 12.4416 12.3024 7.3847 8.5210 5.2615 0.0706 17.1376 2.3231
temp: 298.150 k
press: 1.00000 atm
elementType: 17 8 8 7 7 6 6 6 6 6 6 6 6 6 6 6 6 1 1 1 1 1 1 1 1 1
symmnumber: 1
zpe: 489222.4 jmol-1
zpe.correction: 0.186335 hartree
zpe.thermalcorrener: 0.200824 hartree
zpe.thermalcorrenthalpy: 0.201768 hartree
zpe.thermalcorrgfe: 0.141505 hartree
zpe.sumelectzpe: -1181.478510 hartree
zpe.sumelectthermal: -1181.464021 hartree
zpe.sumelectthermalent: -1181.463077 hartree
zpe.sumelectthermalfe: -1181.523340 hartree
dipole: -1.0298 -0.3708 1.0097
dipole: 1.4891
quadrupole: -108.2205 -115.6166 -99.0347
quadrupole: 11.3969 2.2849 2.5374
quadrupole: -0.5965 -7.9927 8.5892 11.3969 2.2849 2.5374
hfenergy: -1181.6648452 hartree
pointgroup: C01 [X(C12H9Cl1N2O2)]
dipole: -0.38196 0.4281234 -0.118545 debye
dipolederiv: -0.1947613 0.1457571 0.1432898 0.2240518 -0.3657114 -0.354493 0.2385353 -0.3707773 -0.4859221 -1.6291488 -0.0336634 -0.2034167 0.0339999 -0.3635545 -0.0484736 -0.7441171 -0.0122255 -0.6403646 -0.8272145 0.2084383 0.1242707 0.1206481 -0.592887 -0.2683646 -0.1152694 -0.23708 -0.6054261 -0.3485503 -0.05086 0.0547728 -0.1063686 -0.2843926 0.0280139 0.0669581 0.0143735 -0.3678659 -0.3515494 0.0051823 -0.0200429 0.0772857 -0.2939138 -0.0504664 0.0403335 -0.0804271 -0.323956 1.1055242 0.0872079 -0.0082789 -0.1350264 0.3421124 -0.1380849 -0.0182875 -0.1156381 0.322273 -0.0382565 0.0078088 -0.0777221 0.011795 -0.1109426 -0.0053776 0.0143025 0.0275841 -0.2067076 -0.5109954 0.1665059 -0.0355392 0.2288795 -0.0789545 -0.034111 -0.0652076 -0.0594912 -0.0469181 -0.0219657 0.113197 0.0139166 0.0778424 -0.0155674 0.0319022 -0.0279051 0.0002461 0.0513745 1.9137224 -0.4122029 0.1245019 -0.2420116 0.6400316 0.3700976 0.8654659 0.3171343 0.8945658 0.019732 0.0868998 -0.0076003 0.1148251 0.0280803 0.0901002 -0.0143212 0.0074795 0.3028576 0.0246849 0.0481747 0.1344144 -0.0409393 -0.0877858 -0.1014237 -0.0277909 -0.0357723 -0.101419 -0.2048837 -0.0836213 0.0069209 -0.1348375 -0.1905149 0.0407946 -0.100856 -0.0138678 0.0981279 0.137349 -0.0602298 0.01563 -0.0207448 0.0623765 0.1038688 0.0955614 0.1049191 0.1348414 -0.0359187 -0.182754 -0.2942271 -0.3467739 0.4818116 0.569733 -0.5347559 0.6254396 0.6299231 0.1495332 0.195384 -0.1330491 0.2220938 0.1389168 -0.0880098 -0.0156728 0.0298242 0.1514253 0.2374799 -0.0725995 0.0703025 0.009369 -0.0292902 -0.0316402 0.1880161 -0.0792474 -0.0097166 -0.0274505 0.0030435 -0.0284726 0.0118191 0.106182 -0.0318226 -0.0236396 0.0682432 -0.0853031 -0.0395948 -0.0496468 0.0037647 0.0340576 -0.0415593 0.0120802 0.0479542 -0.1024645 0.07628 0.1485783 -0.0717307 -0.0549149 -0.0556573 0.0674341 -0.0434333 -0.0618021 -0.0310941 0.0842622 0.1102365 -0.0209385 0.0597178 -0.0178789 0.1022739 0.0104833 0.0643083 0.0140325 -0.0934131 0.1444175 -0.0130242 -0.0521558 -0.0360863 0.1402685 -0.0198983 -0.0585956 -0.0250574 0.0895286 0.111812 -0.0333416 0.0353498 -0.0334802 0.1230704 -0.0208245 0.0677025 -0.0074117 -0.0919492 0.1193124 0.0408874 0.0305953 0.0403471 0.0846311 -0.0583486 0.0398475 -0.059419 0.0711943 0.010811 -0.0977462 0.0811259 -0.1088307 0.0491832 0.062834 0.0687198 0.0419353 0.0414094 -0.0029035 0.073872 0.0168465 0.0716216 0.0887016 -0.0251357 0.0105158 -0.0212382 0.1108984 unknown
polarizability: 194.503874|-5.2910914|119.4514522|-9.2809087|30.4438655|150.2334525 unknown
InChI: InChI=1S/C12H9ClN2O2/c13-11-4-10(6-15-7-11)12(16)17-8-9-2-1-3-14-5-9/h1-7H,8H2
charge 0 multiplicity 1
26 atoms
Cl 4.064416 -2.157944 -2.155056
O  -0.263043 0.738512 -0.914242
O  0.11792 1.824767 1.12105
N  -4.363736 -1.294246 -0.46339
N  4.02321 0.116156 1.237603
C  -1.645045 1.344157 -0.969572
C  -2.662243 0.469085 -0.276738
C  1.849456 0.409172 0.153141
C  -2.894885 0.560318 1.120099
C  0.509414 1.065191 0.2011
C  -3.428133 -0.468947 -1.015893
C  2.227045 -0.466417 -0.896608
C  -3.859319 -0.284943 1.708857
C  2.777811 0.668638 1.195264
C  3.51311 -1.0291 -0.842885
C  -4.563856 -1.194147 0.884869
C  4.386652 -0.725419 0.225752
H  -1.83588 1.416598 -2.051457
H  -1.591281 2.348032 -0.514516
H  -2.320347 1.272541 1.721856
H  -3.289929 -0.566241 -2.100642
H  1.532073 -0.687065 -1.709852
H  -4.065978 -0.243773 2.782698
H  2.505709 1.340093 2.01544
H  -5.31808 -1.868658 1.305808
H  5.390439 -1.159462 0.277318
