program: Gaussian 09
title: 000211884
version: EM64L-G09RevD.01
frameworkgroup: C1[X(C21H21N3O2)]
method: RPBEPBE
basis: SDD
operation: Freq
keyword: #p
keyword: freq=noraman
keyword: PBEPBE/SDD
title: #p freq=noraman PBEPBE/SDD
converged: NO YES NO NO
title: Mulliken charges:
elementType: O O N N N C C C C C C C C C C C C C C C C C C C C C H H H H H H H H H H H H H H H H H H H H H
charge: -0.265659 -0.291671 -0.048226 -0.258774 -0.262209 -0.405074 -0.376263 -0.373714 -0.446366 -0.397609 -0.130057 -0.018637 0.086232 0.143808 0.442051 0.434149 -0.377100 -0.374760 -0.356270 -0.354795 -0.218761 -0.217454 -0.210984 -0.210560 -0.255031 -0.253941 0.194310 0.229436 0.218106 0.216915 0.211748 0.218120 0.327890 0.210153 0.223574 0.225362 0.268011 0.284524 0.279942 0.265543 0.267557 0.225289 0.225118 0.225432 0.226266 0.226999 0.227380
chargesum: 0.00000
title: Mulliken charges with hydrogens summed into heavy atoms:
elementType: O O N N N C C C C C C C C C C C C C C C C C C C C C
charge: -0.265659 -0.291671 -0.048226 -0.258774 -0.262209 0.018672 0.058758 0.056154 0.091677 0.051327 0.137954 -0.018637 0.086232 0.143808 0.442051 0.434149 -0.092576 -0.094818 -0.090727 -0.087238 0.006528 0.007664 0.014448 0.015705 -0.028032 -0.026561
polarizability: 3.90099820e+02 1.88329261e+00 2.70081725e+02 -7.04642086e+00 2.44285071e+01 1.71505758e+02
1716.lowfreq: -23.1428 -14.1167 -6.0039 -0.0008 -0.0005 -0.0002 17.0160 21.9025 45.6596
frequency: -4.3158 19.3896 45.6395 47.4412 57.6508 62.5266 74.4431 76.2186 106.6490 140.4221 182.8401 209.2758 211.7274 219.8117 252.7162 273.6829 284.7239 298.0176 324.3641 342.3666 375.4477 389.4820 406.4334 407.6785 409.1489 438.9455 450.1107 466.0797 501.6607 504.9541 530.9915 574.8875 608.8613 611.5033 617.3376 636.8600 656.0280 671.1041 691.9097 694.3409 728.8651 750.3387 757.7213 760.4547 797.9381 811.9509 835.9813 836.5106 839.5007 849.7638 855.9685 874.8805 906.6483 908.0845 914.4152 947.7812 967.6937 969.0210 979.4828 986.1665 987.1146 988.1256 989.0479 997.9821 1022.8387 1025.2035 1035.6276 1057.4705 1072.1682 1080.1222 1088.6289 1102.6796 1115.8759 1127.4007 1145.6978 1157.7065 1172.2911 1172.3056 1177.5090 1188.7548 1189.9888 1234.1027 1250.2837 1261.4724 1280.2700 1287.0135 1295.8120 1321.7036 1331.3807 1332.6808 1336.4383 1343.5478 1346.2852 1382.5387 1385.5696 1391.0402 1406.5995 1441.3674 1445.9798 1453.6136 1457.6271 1464.2445 1466.3768 1472.3885 1479.5648 1483.7083 1496.7776 1588.1696 1591.1613 1598.9284 1606.6369 1610.3811 1616.1600 1667.5125 2961.3398 2972.6156 2975.5903 2990.0374 2994.1782 3043.6317 3046.3936 3053.1907 3061.9025 3070.8503 3079.4201 3128.3119 3129.0662 3139.7812 3140.3331 3158.5157 3159.2527 3172.3213 3173.3366 3193.4956 3194.5029
redmass: 4.0625 3.9838 4.9709 4.7233 4.3510 3.8920 4.7211 5.8185 8.0014 3.5725 4.3684 4.7398 4.7186 4.0615 4.6044 4.9022 2.8429 2.7119 7.6870 5.7318 6.4731 3.2050 3.1699 3.3061 3.4663 2.8039 3.4562 2.7229 3.4158 3.3972 5.2843 2.3331 6.6151 6.5638 7.4752 7.1717 9.7067 5.9647 2.2545 2.1377 3.5089 3.4639 2.4252 1.7918 1.7528 3.1279 1.4400 1.2581 2.6167 1.4218 6.6771 3.8283 1.4328 1.4685 2.6979 1.3425 1.3947 1.3736 1.3539 5.1923 4.6516 1.3854 1.3376 2.5002 2.5614 2.3962 2.1636 2.6531 2.2137 1.7182 2.1596 2.5343 2.6769 2.6706 2.7302 1.3225 1.0504 1.0585 2.0561 1.1224 1.1232 3.2435 1.3409 1.3247 3.7800 1.5645 2.5605 1.3434 1.2909 1.4344 1.3536 1.4377 1.4027 8.0037 10.0457 1.3890 1.4046 2.3459 2.3647 2.4010 1.1955 1.1028 1.0962 1.0964 2.3022 2.3408 1.0991 6.3823 6.6890 8.0215 6.5383 7.0176 9.3971 7.8625 1.0629 1.0645 1.0660 1.0609 1.0620 1.0961 1.1036 1.1023 1.1032 1.0981 1.0906 1.0851 1.0850 1.0902 1.0903 1.0957 1.0957 1.0972 1.0970 1.0955 1.0954
irintensity: 1.6398 0.6018 0.8584 0.9079 0.3644 1.1421 0.5403 0.3707 2.7835 0.4111 0.8178 2.6461 0.0162 1.4224 6.4735 1.8421 2.0864 0.7850 21.0516 6.8416 2.1139 1.8473 1.3468 0.5050 5.0638 0.4861 20.5141 5.0724 3.0646 18.7070 9.9942 1.5372 7.3138 2.9007 11.8496 18.7871 11.4864 1.4482 20.1702 43.0656 32.0596 5.3002 85.7071 58.6238 3.4630 6.1796 1.8603 0.5492 0.7574 19.3730 6.5658 2.0746 6.9054 4.4365 11.3447 7.6600 0.4693 0.6464 7.3644 0.2427 0.0760 0.2999 0.5820 71.2277 16.3015 8.0381 0.4310 7.6141 0.5219 43.8118 84.6081 31.7023 18.2120 114.5260 91.4143 19.4660 1.3108 4.7789 188.6404 8.7562 7.2595 34.5404 9.9040 21.9612 140.8192 125.7941 297.8946 1.0086 4.9729 8.6479 2.0337 1.4438 8.9284 1.0149 2.5134 38.1382 177.7974 3.7207 19.7662 64.6342 9.3296 15.4232 52.4488 7.9952 79.3074 131.2782 37.6304 1.0079 37.6395 164.1578 60.1303 215.7618 316.9256 904.4140 80.6215 33.3888 78.7081 27.7534 23.6454 61.2793 59.9964 50.1806 47.8334 32.5374 4.4447 0.3640 0.3345 18.9646 16.8780 42.7130 35.9743 7.2195 7.7530 1.5185 1.3951
temp: 298.150 k
press: 1.00000 atm
elementType: 8 8 7 7 7 6 6 6 6 6 6 6 6 6 6 6 6 6 6 6 6 6 6 6 6 6 1 1 1 1 1 1 1 1 1 1 1 1 1 1 1 1 1 1 1 1 1
symmnumber: 1
zpe: 992976.9 jmol-1
zpe.correction: 0.378205 hartree
zpe.thermalcorrener: 0.399316 hartree
zpe.thermalcorrenthalpy: 0.400260 hartree
zpe.thermalcorrgfe: 0.327153 hartree
zpe.sumelectzpe: -1125.682102 hartree
zpe.sumelectthermal: -1125.660991 hartree
zpe.sumelectthermalent: -1125.660047 hartree
zpe.sumelectthermalfe: -1125.733154 hartree
dipole: 4.5168 0.4872 0.4046
dipole: 4.5610
quadrupole: -108.2198 -156.9357 -149.1140
quadrupole: -3.6735 -1.7551 1.5075
quadrupole: 29.8700 -18.8459 -11.0241 -3.6735 -1.7551 1.5075
hfenergy: -1126.060307 hartree
pointgroup: C01 [X(C21H21N3O2)]
dipole: 1.7869041 0.0790171 0.1439869 debye
polarizability: 389.7318348|-2.4385372|260.4940858|-9.7879563|38.4468999|181.4613828 unknown
InChI: InChI=1S/C21H21N3O2/c25-20-19(16-22-14-8-3-9-15-22)21(26)24(18-12-6-2-7-13-18)23(20)17-10-4-1-5-11-17/h1-2,4-7,10-13,16H,3,8-9,14-15H2
charge 0 multiplicity 1
47 atoms
O  0.231225 -2.379709 -1.446042
O  1.312778 1.905563 0.554641
N  3.824222 -0.264608 -0.698388
N  -1.012619 -0.597539 -0.451053
N  -0.670721 0.654994 0.172477
C  6.332381 -0.104259 0.812467
C  5.073338 0.689075 1.23346
C  5.936122 -1.380042 0.032686
C  4.16672 0.995629 0.0183
C  5.016248 -1.029665 -1.159474
C  2.584725 -0.770262 -0.883806
C  1.297386 -0.337488 -0.539666
C  0.18645 -1.237468 -0.899631
C  0.752907 0.847079 0.124241
C  -2.193627 -1.306431 -0.042119
C  -1.613261 1.741758 0.141355
C  -2.684342 -2.346201 -0.874029
C  -1.448691 2.816347 1.052439
C  -2.85698 -0.98929 1.170749
C  -2.686134 1.749596 -0.786337
C  -3.830134 -3.067902 -0.478088
C  -2.3537 3.898542 1.018554
C  -4.010651 -1.711336 1.542813
C  -3.59074 2.832043 -0.795844
C  -4.503786 -2.75404 0.725228
C  -3.43041 3.912785 0.101755
H  6.970116 0.535492 0.167825
H  6.937525 -0.3703 1.698728
H  4.492996 0.113584 1.980409
H  5.355114 1.647057 1.708732
H  6.834012 -1.901859 -0.349018
H  5.405335 -2.082838 0.703728
H  3.237512 1.508926 0.316647
H  4.712988 1.644674 -0.697443
H  5.571164 -0.399243 -1.884155
H  4.679909 -1.939707 -1.684411
H  2.566602 -1.735162 -1.414757
H  -2.156732 -2.592552 -1.797511
H  -0.613214 2.80568 1.754786
H  -2.472882 -0.194062 1.8152
H  -2.80696 0.922057 -1.490524
H  -4.199786 -3.875595 -1.119567
H  -2.217888 4.730385 1.718611
H  -4.52074 -1.458691 2.4791
H  -4.42007 2.830105 -1.511902
H  -5.39892 -3.311891 1.020813
H  -4.134987 4.751374 0.088124
