program: Gaussian 09
title: 000211878
version: EM64L-G09RevD.01
frameworkgroup: C1[X(C17H27N3)]
method: RPBEPBE
basis: SDD
operation: Freq
keyword: #pfreq=noraman
keyword: PBEPBE/SDD
title: #p freq=noraman PBEPBE/SDD
converged: YES YES NO NO
title: Mulliken charges:
elementType: N N N C C C C C C C C C C C C C C C C C H H H H H H H H H H H H H H H H H H H H H H H H H H H
charge: -0.211544 -0.124795 -0.092365 -0.045065 -0.423608 -0.400158 -0.368856 -0.708536 0.298897 -0.316291 -0.309207 -0.256355 -0.024092 -0.356846 -0.524228 -0.705022 -0.679950 0.473053 -0.357383 -0.817837 0.209030 0.206248 0.230619 0.224777 0.200925 0.198295 0.201050 0.240079 0.225241 0.214635 0.185036 0.212951 0.185028 0.207256 0.300183 0.232626 0.250073 0.273575 0.200691 0.212098 0.223440 0.205516 0.211215 0.222880 0.225087 0.225740 0.225893
chargesum: 0.00000
title: Mulliken charges with hydrogens summed into heavy atoms:
elementType: N N N C C C C C C C C C C C C C C C C C
charge: -0.211544 -0.124795 -0.092365 0.163965 0.013258 0.025544 0.030489 -0.028580 0.298897 0.081695 0.083077 0.043828 -0.024092 -0.124219 -0.274155 -0.018658 -0.039778 0.473053 -0.134503 -0.141117
polarizability: 2.74951304e+02 1.16842649e+01 2.02947176e+02 -1.40083522e+01 1.05846157e+01 1.44940267e+02
1716.lowfreq: -6.3132 -0.4492 0.0004 0.0006 0.0009 5.7550 21.8197 26.4417 43.7872
frequency: 21.7591 26.4181 43.7588 51.5617 58.3990 75.3949 93.8611 96.4302 119.6102 135.0339 157.2816 167.7367 203.8119 214.6351 223.4796 225.7907 261.4086 286.0473 294.9901 297.5672 317.4021 321.0121 360.8805 389.1806 426.4517 433.2261 457.1735 468.0982 473.4749 496.1594 550.2236 580.7156 605.2271 635.2887 638.2721 695.8458 749.2666 767.6395 786.3303 797.8779 799.1608 807.2752 812.5349 846.3443 858.7896 893.9600 907.3778 918.8963 924.5221 925.7515 936.2134 990.0761 1001.2251 1006.3144 1041.9819 1047.4149 1052.1270 1068.0416 1072.6239 1082.5806 1088.0844 1096.2632 1117.0180 1125.9863 1131.6527 1139.9577 1158.6237 1192.3394 1197.2005 1221.6743 1241.6187 1255.6524 1273.7234 1279.8158 1284.2707 1290.3479 1291.5426 1298.7992 1324.5215 1325.6806 1356.1344 1358.2504 1364.8674 1366.2858 1374.5791 1389.0694 1389.4026 1393.5485 1397.2517 1405.4767 1440.9245 1451.2170 1460.4170 1462.3094 1466.2065 1467.0514 1469.4576 1470.6895 1474.2783 1477.4247 1478.3687 1479.8218 1484.8443 1487.8312 1491.4037 1492.4184 1586.3597 1632.9226 2849.7124 2859.4912 2881.9998 2971.5371 2972.0360 2981.2843 2983.9745 2985.2957 2988.7027 2988.9658 3020.8293 3027.6463 3035.9876 3043.0665 3047.7775 3053.2591 3074.2273 3076.6102 3082.3411 3084.5055 3086.8870 3089.9014 3100.1603 3116.8469 3142.0647 3147.8934 3195.9867
redmass: 3.7220 4.5064 3.8728 3.2203 1.0734 3.4248 1.9123 1.7625 3.5669 3.1102 2.6263 2.8516 1.5179 1.2473 1.2069 3.3652 2.4172 2.1419 2.2875 2.4490 2.9577 2.1514 3.5482 2.8942 2.8080 2.5354 3.3127 2.5936 4.6617 3.4912 3.2072 3.6662 3.2935 3.5708 4.3238 2.3761 5.3760 4.1760 1.3752 1.4125 1.1615 1.6208 2.8313 1.8137 1.3536 1.4102 1.9800 2.5383 2.4334 1.7409 1.3393 1.6740 1.4760 2.3990 3.1736 1.5280 2.1634 2.3001 2.1140 2.5723 2.0909 2.0455 2.3906 2.0200 1.5589 1.5073 1.7522 2.2360 2.1986 1.9176 1.7370 1.4345 1.4814 1.7442 1.1962 1.3345 1.2604 1.5752 2.2059 1.9744 1.4451 1.3288 1.3553 1.5041 1.3741 1.2527 1.2715 2.3724 1.2649 1.2320 3.3951 3.4729 1.0714 1.0796 1.6408 1.0648 1.0601 1.0464 1.0930 1.0601 1.0604 1.0549 1.0676 1.0759 1.1219 1.6973 7.0669 7.5756 1.0721 1.0719 1.0706 1.0804 1.0398 1.0359 1.0395 1.0610 1.0566 1.0388 1.0915 1.0878 1.0952 1.0878 1.0977 1.1018 1.0983 1.0971 1.0982 1.0999 1.1002 1.1003 1.1000 1.0871 1.0961 1.0934 1.1007
irintensity: 0.2062 0.4284 0.7019 0.3294 0.1969 0.4546 0.5459 0.1841 0.4669 1.4821 0.3002 1.7593 2.7899 0.0156 0.2389 0.3711 0.6592 4.5034 1.2072 1.0906 0.7060 0.5740 1.0313 3.3430 7.9408 5.3251 1.2494 3.9466 0.9588 3.0251 4.8673 2.3975 4.0969 1.2900 13.3134 11.1879 2.4481 0.1494 10.8099 51.2168 9.3603 6.4613 6.9651 1.6900 16.4248 14.7127 2.8722 3.7635 3.6379 0.7745 1.4857 19.3649 13.3892 1.2088 4.2138 11.3529 18.7474 1.0522 22.0351 12.2789 5.1898 12.6820 6.2522 4.8458 14.2045 1.6165 31.1424 32.4156 3.3310 2.2571 68.1681 24.7333 15.0158 20.9922 11.8638 31.0968 2.8010 6.0195 5.8955 6.3264 9.0201 12.2035 11.7810 26.4324 1.8825 36.7287 1.0449 1.1310 8.7921 14.1895 25.8597 22.1029 0.3983 3.4657 23.9836 5.0112 0.5403 12.6195 29.5617 8.5840 13.5315 3.9576 3.7912 24.1464 10.3652 26.9578 6.8666 1.8350 40.3592 133.8243 188.3840 17.8608 50.4845 25.3577 9.2635 32.1116 49.9120 25.8767 8.0671 18.3003 20.5980 7.0456 25.1659 66.1374 27.4469 89.4531 19.3280 38.2322 49.8619 25.8086 28.4107 11.3353 28.8256 5.8988 31.9022
temp: 298.150 k
press: 1.00000 atm
elementType: 7 7 7 6 6 6 6 6 6 6 6 6 6 6 6 6 6 6 6 6 1 1 1 1 1 1 1 1 1 1 1 1 1 1 1 1 1 1 1 1 1 1 1 1 1 1 1
symmnumber: 1
zpe: 1075386.0 jmol-1
zpe.correction: 0.409593 hartree
zpe.thermalcorrener: 0.431196 hartree
zpe.thermalcorrenthalpy: 0.432141 hartree
zpe.thermalcorrgfe: 0.357764 hartree
zpe.sumelectzpe: -826.713206 hartree
zpe.sumelectthermal: -826.691603 hartree
zpe.sumelectthermalent: -826.690659 hartree
zpe.sumelectthermalfe: -826.765035 hartree
dipole: 2.2003 3.2539 1.7710
dipole: 4.3088
quadrupole: -109.9125 -118.2513 -125.8150
quadrupole: -1.5826 -1.6188 -0.5131
quadrupole: 8.0804 -0.2583 -7.8221 -1.5826 -1.6188 -0.5131
hfenergy: -827.1227992 hartree
pointgroup: C01 [X(C17H27N3)]
dipole: -0.8322288 -1.1566842 0.9182386 debye
polarizability: 275.8873738|12.4542681|198.3601865|6.5023612|-19.3430952|148.5911871 unknown
InChI: InChI=1S/C17H27N3/c1-5-19(6-2)11-7-8-15(4)20-13-18-16-12-14(3)9-10-17(16)20/h9-10,12-13,15H,5-8,11H2,1-4H3
charge 0 multiplicity 1
47 atoms
N  0.433936 -0.789326 -0.019241
N  -3.555021 0.685042 0.427354
N  0.683093 1.247965 -1.052988
C  -0.194765 -2.046471 0.463222
C  -1.711923 -1.855448 0.692089
C  -2.08283 -0.84265 1.801608
C  -3.496571 -0.25203 1.590735
C  0.09213 -3.203966 -0.523316
C  1.806454 -0.484775 0.041748
C  -3.122138 2.058629 0.835553
C  -4.898803 0.688144 -0.222157
C  -0.17808 0.280064 -0.690032
C  1.945726 0.7893 -0.604965
C  2.91486 -1.163706 0.592257
C  3.218293 1.398272 -0.705466
C  -2.747517 2.985021 -0.336671
C  -5.153258 -0.557829 -1.090868
C  4.340882 0.735701 -0.161678
C  4.170787 -0.534408 0.479427
C  5.729059 1.351903 -0.246295
H  0.284061 -2.27862 1.437262
H  -2.137352 -2.848915 0.933943
H  -2.185082 -1.536467 -0.256474
H  -1.345278 -0.018189 1.827199
H  -2.038164 -1.333802 2.794388
H  -4.204009 -1.082646 1.408286
H  -3.838538 0.255778 2.525816
H  1.17384 -3.305989 -0.718326
H  -0.414612 -3.021651 -1.48819
H  -0.278455 -4.160041 -0.110901
H  -3.911757 2.545144 1.464314
H  -2.232683 1.945406 1.482707
H  -5.713176 0.793651 0.539374
H  -4.958707 1.580789 -0.86915
H  -1.256506 0.3214 -0.843735
H  2.819607 -2.135148 1.08979
H  3.319789 2.370831 -1.198644
H  -1.89635 2.580515 -0.909284
H  -3.591713 3.149667 -1.030046
H  -2.446963 3.974168 0.056238
H  -4.387777 -0.632856 -1.883451
H  -5.126737 -1.49184 -0.500049
H  -6.148475 -0.494998 -1.569286
H  5.054608 -1.032832 0.897032
H  6.163097 1.509549 0.759474
H  6.428024 0.69903 -0.803198
H  5.705295 2.329635 -0.757506
