program: Gaussian 09
title: 000211876
version: EM64L-G09RevD.01
frameworkgroup: C1[X(C11H17NO2S)]
method: RPBEPBE
basis: SDD
operation: Freq
keyword: #p
keyword: freq=noraman
keyword: PBEPBE/SDD
title: #p freq=noraman PBEPBE/SDD
converged: YES YES NO NO
title: Mulliken charges:
elementType: S O O N C C C C C C C C C C C H H H H H H H H H H H H H H H H H
charge: 0.913054 -0.539993 -0.542616 -0.509357 -0.080981 -0.363278 -0.663575 -0.001893 -0.681822 -0.254767 -0.237703 0.452972 -0.370921 -0.357195 -0.799795 0.268207 0.189246 0.201387 0.299427 0.235653 0.206443 0.209528 0.232688 0.233132 0.211427 0.284981 0.277084 0.243005 0.242440 0.230050 0.231265 0.241908
chargesum: 0.00000
title: Mulliken charges with hydrogens summed into heavy atoms:
elementType: S O O N C C C C C C C C C C C
charge: 0.913054 -0.539993 -0.542616 -0.209929 0.187225 0.027355 -0.011951 -0.001893 -0.004575 0.030214 0.039380 0.452972 -0.127916 -0.114755 -0.096572
polarizability: 2.18930234e+02 -4.15391529e+00 1.39688909e+02 5.16498670e+00 1.53272807e+01 1.24839118e+02
1716.lowfreq: -16.5672 -4.7452 -0.0021 -0.0012 -0.0011 4.6132 12.7535 22.1151 39.0893
frequency: 11.4651 20.7288 39.0590 42.2435 81.7025 89.6456 128.9317 136.5145 160.0889 203.6979 214.7304 227.5145 235.9271 257.4231 280.0680 293.7707 320.1583 364.8214 384.7602 403.0939 408.5795 423.2172 464.1365 507.3403 516.1789 589.5581 622.3598 710.7672 765.7827 770.0870 779.6187 798.2317 828.8181 839.1235 850.0331 905.7461 932.5788 963.6767 968.8965 983.2793 990.4462 995.8253 1001.1736 1036.3171 1049.4441 1055.3898 1113.9517 1117.9411 1125.8556 1156.6937 1184.5485 1218.6684 1235.0631 1278.2067 1291.0114 1296.4172 1333.6665 1374.0487 1380.9787 1383.6796 1392.0084 1399.4674 1403.0232 1458.2682 1465.3632 1470.7763 1474.6237 1475.3446 1475.4773 1480.2258 1493.7901 1596.5690 1597.8249 2956.9336 2980.1635 2981.0593 2982.5791 2993.3158 3019.5764 3062.5589 3074.7802 3077.4961 3083.7635 3092.2711 3101.6261 3135.3357 3136.9818 3162.3593 3165.6650 3340.9168
redmass: 1.0229 3.4425 4.0519 4.1108 4.0515 1.8419 5.2948 4.0820 3.8978 1.2339 4.5533 3.5598 1.6620 2.6800 3.2833 4.2634 3.8593 3.5290 3.7776 4.4346 2.9803 2.5949 4.1697 3.4811 3.2413 5.9182 6.9584 3.2876 1.2936 2.7241 3.8292 10.9536 1.3567 1.6414 1.2472 2.2741 4.2255 1.3072 1.2604 1.3783 1.4794 4.4928 1.4581 3.5734 1.5892 2.4974 2.4402 1.3264 1.6900 2.0080 1.1429 2.9963 1.2409 1.2804 1.1970 1.2646 1.5359 1.2221 4.5164 1.2334 3.0766 1.2242 1.1966 1.0671 1.0547 1.0958 2.0242 1.0670 1.1375 1.0438 1.0513 6.4052 6.5531 1.0630 1.0390 1.0364 1.0376 1.0809 1.0984 1.0948 1.0995 1.0995 1.1002 1.1000 1.0997 1.0892 1.0894 1.0953 1.0965 1.0742
irintensity: 0.5339 0.5588 1.0504 0.7081 1.6971 0.2213 2.4101 2.0637 2.0959 0.1160 4.3207 16.3300 4.8499 1.3250 2.3564 11.8773 2.7078 2.0797 2.7139 8.6515 2.4176 46.2695 58.6216 19.6843 73.8625 29.4784 0.2763 1.0672 77.2789 34.5962 29.5665 77.6445 44.7598 35.0657 1.7661 12.8907 38.1464 1.5439 20.9762 0.2700 1.8824 3.6546 25.4345 0.6598 19.0564 23.3286 7.5745 19.1421 26.9800 12.6703 9.2437 5.3498 2.2945 10.2686 4.4848 2.5962 1.1347 6.2010 0.7789 8.2732 9.7084 15.1555 15.0882 2.8489 14.2351 17.5410 26.1339 8.0847 11.6472 20.6242 25.4989 3.8722 2.9028 39.3123 27.1587 27.0841 30.7567 2.8678 25.9959 19.8244 20.9035 43.9548 36.4008 15.1864 30.3417 14.3780 7.7371 2.1068 8.8499 13.0515
temp: 298.150 k
press: 1.00000 atm
elementType: 16 8 8 7 6 6 6 6 6 6 6 6 6 6 6 1 1 1 1 1 1 1 1 1 1 1 1 1 1 1 1 1
symmnumber: 1
zpe: 679920.5 jmol-1
zpe.correction: 0.258968 hartree
zpe.thermalcorrener: 0.276609 hartree
zpe.thermalcorrenthalpy: 0.277553 hartree
zpe.thermalcorrgfe: 0.210718 hartree
zpe.sumelectzpe: -1031.300812 hartree
zpe.sumelectthermal: -1031.283171 hartree
zpe.sumelectthermalent: -1031.282227 hartree
zpe.sumelectthermalfe: -1031.349062 hartree
dipole: -2.7393 3.5236 -2.2544
dipole: 5.0002
quadrupole: -76.1543 -105.2246 -99.9494
quadrupole: 3.0638 -2.2168 5.6699
quadrupole: 17.6218 -11.4485 -6.1733 3.0638 -2.2168 5.6699
hfenergy: -1031.5597799 hartree
pointgroup: C01[X(C11H17N1O2S1)]
dipole: 1.2457931 -1.1503996 -0.9972658 debye
polarizability: 218.9838298|5.1527425|143.1613452|-0.5578325|-13.5329626|121.3130855 unknown
InChI: InChI=1S/C11H17NO2S/c1-4-10(3)12-15(13,14)11-7-5-9(2)6-8-11/h5-8,10,12H,4H2,1-3H3
charge 0 multiplicity 1
32 atoms
S  -0.821629 0.491325 0.484307
O  -1.256793 -0.01554 1.9734
O  -1.155013 1.995939 -0.063653
N  -1.500754 -0.772343 -0.742343
C  -2.641297 -1.598502 -0.222468
C  -4.039426 -0.980523 -0.492375
C  -2.496382 -3.002367 -0.853867
C  1.037605 0.246379 0.324163
C  -4.297636 0.367529 0.214754
C  1.741841 1.089303 -0.54849
C  1.651609 -0.741603 1.109397
C  3.81168 -0.079264 0.115485
C  3.140547 0.914584 -0.644291
C  3.050492 -0.893695 0.996684
C  5.310968 -0.275011 -0.015555
H  -2.487777 -1.673842 0.873138
H  -4.173844 -0.869878 -1.58999
H  -4.797909 -1.718464 -0.163276
H  -1.769567 -0.189734 -1.561542
H  -1.492617 -3.413139 -0.655324
H  -2.641962 -2.960508 -1.949157
H  -3.254362 -3.688052 -0.431945
H  -4.150097 0.275632 1.305956
H  -3.619111 1.164779 -0.141456
H  -5.333725 0.706863 0.033751
H  1.218094 1.872602 -1.105767
H  1.060126 -1.34733 1.803061
H  3.716776 1.563812 -1.313352
H  3.557324 -1.651832 1.604854
H  5.813174 0.647781 -0.353246
H  5.765278 -0.582144 0.94258
H  5.540984 -1.065754 -0.755736
