program: Gaussian 09
title: 000211874
version: EM64L-G09RevD.01
frameworkgroup: C1[X(C6H9IO)]
method: RPBEPBE
basis: SDD
operation: Freq
keyword: #pfreq=noraman
keyword: PBEPBE/SDD
title: #p freq=noraman PBEPBE/SDD
converged: YES YES NO NO
title: Mulliken charges:
elementType: I O C C C C C C H H H H H H H H H
charge: 0.149841 -0.452875 0.163357 -0.370599 -0.706567 -0.701401 0.451628 -0.642822 0.197986 0.215226 0.217021 0.234672 0.222568 0.248680 0.224457 0.208814 0.340015
chargesum: 0.00000
title: Mulliken charges with hydrogens summed into heavy atoms:
elementType: I O C C C C C C
charge: 0.149841 -0.112859 0.163357 0.042612 -0.032306 -0.019451 0.451628 -0.642822
polarizability: 1.39059531e+02 5.02132303e+00 6.53308466e+01 3.93617005e-01 -5.47474359e-01 5.83477977e+01
1716.lowfreq: -12.4389 -0.0009 -0.0005 -0.0003 2.2012 6.4240 60.1638 80.5937 110.9483
frequency: 60.1500 80.5665 110.9386 199.5977 220.5201 232.2301 236.3775 254.5097 279.0324 303.1241 354.9507 410.3323 477.0529 529.3907 568.2772 732.0394 778.7657 863.3510 913.8752 993.8656 1029.5035 1056.6373 1090.3287 1133.4383 1185.5429 1274.2329 1310.1126 1333.5167 1381.7780 1389.5885 1447.9775 1463.8859 1468.1823 1471.7362 1490.8786 2209.9110 2986.6788 2989.7669 2996.1079 3051.4531 3081.1782 3086.2263 3098.9645 3105.0894 3547.8913
redmass: 3.8450 3.7215 2.4493 3.3007 1.3410 1.2107 4.8112 2.8907 2.3257 1.3529 3.1078 3.9371 3.1231 5.8994 4.4385 4.5843 1.3486 2.3614 2.1013 1.3731 1.7270 2.4248 1.9360 2.0958 2.3837 1.2827 1.5719 1.5793 1.1998 1.2127 1.0767 1.0571 1.0557 1.0399 1.0519 11.9816 1.0356 1.0372 1.0577 1.1016 1.0997 1.0998 1.1006 1.1001 1.0662
irintensity: 0.4433 0.4806 1.9710 3.2450 3.0833 1.6754 10.4408 5.8203 21.4517 141.0005 9.5742 2.6815 4.3356 6.4498 7.5755 4.7453 4.3737 58.4031 1.1220 29.9610 29.6664 8.6955 28.4590 32.5355 29.8511 2.3951 85.3476 7.3682 8.6936 23.3748 3.0932 14.1252 2.2425 11.6553 12.7260 25.1769 10.6079 41.5070 26.5766 9.8682 47.5974 30.3437 24.7979 34.8871 8.2408
temp: 298.150 k
press: 1.00000 atm
elementType: 53 8 6 6 6 6 6 6 1 1 1 1 1 1 1 1 1
symmnumber: 1
zpe: 348589.1 jmol-1
zpe.correction: 0.132771 hartree
zpe.thermalcorrener: 0.143175 hartree
zpe.thermalcorrenthalpy: 0.144119 hartree
zpe.thermalcorrgfe: 0.095388 hartree
zpe.sumelectzpe: -320.055213 hartree
zpe.sumelectthermal: -320.044809 hartree
zpe.sumelectthermalent: -320.043865 hartree
zpe.sumelectthermalfe: -320.092596 hartree
dipole: 0.6577 -1.1607 -0.7223
dipole: 1.5170
quadrupole: -59.5761 -61.4051 -62.9506
quadrupole: 3.0935 4.1703 -2.2719
quadrupole: 1.7345 -0.0945 -1.6400 3.0935 4.1703 -2.2719
hfenergy: -320.1879838 hartree
pointgroup: C01 [X(C6H9I1O1)]
dipole: 0.2797449 -0.437012 -0.2949419 debye
dipolederiv: -0.0762456 -0.0378797 -0.0019501 -0.0422021 0.1869809 0.0014581 -0.0101183 -0.0010516 0.1843688 -0.6417016 -0.2343993 0.086126 -0.257432 -0.4008064 -0.0259838 0.218618 -0.0361167 -0.7692008 0.9087451 0.1425283 -0.0375723 0.1690191 0.402296 -0.0220807 -0.1486806 -0.0305072 0.6522182 0.0004965 0.0038896 -0.0522558 -0.0929937 0.0411674 0.01241 0.0583811 -0.0311057 0.0967199 -0.11267 -0.0602093 -0.0201187 0.0051861 -0.1138188 -0.1158871 0.0245723 -0.0176578 -0.0201825 0.0552867 0.0148045 -0.0052838 0.006227 -0.0701513 -0.0569138 -0.0358778 -0.012508 0.016169 -0.4297401 -0.0881387 0.0399081 -0.1153304 -0.0803659 0.009979 -0.0630966 0.0143624 -0.0995595 0.2014567 0.0794066 0.0046819 0.1030567 -0.3201396 0.00199 0.0203305 -0.0005673 -0.3059874 0.0829661 0.0083558 0.0761158 0.0130145 0.0335341 -0.0263748 0.0359106 -0.0213906 -0.1549834 -0.1817409 -0.0643958 -0.0243216 -0.0202496 0.0127312 0.0023154 -0.01066 -0.0095023 0.0903727 0.0538423 0.1046646 -0.0611411 0.0832531 -0.0829498 0.0481484 -0.0501863 0.0957092 0.0290062 -0.162793 -0.0644191 -0.0096178 -0.0640478 0.0663132 -0.0203702 -0.0081635 -0.0199764 0.0949149 0.0884169 -0.0098014 0.0690337 -0.0062576 0.0865941 0.0289934 0.055933 -0.012113 -0.1245244 0.0921368 -0.0093065 0.0432306 -0.0377222 0.1095279 0.0116714 0.0550758 -0.0436223 -0.1037162 -0.1270386 -0.0994045 0.0160786 -0.0814577 0.0690212 -0.0155066 0.0329306 -0.0100516 0.0821067 -0.0078752 0.1215142 -0.0674267 0.1272205 -0.0981928 0.0628562 -0.0826943 0.0843643 0.0487208 0.256458 0.1927906 -0.0554869 0.210716 0.1582587 0.103295 -0.0922745 0.0517347 0.2835568 unknown
polarizability: 138.5107011|7.99145|65.8868842|1.3634289|-0.2346474|58.3405897 unknown
InChI: InChI=1S/C6H9IO/c1-3-6(2,8)4-5-7/h8H,3H2,1-2H3
charge 0 multiplicity 1
17 atoms
I  3.843636 0.228452 0.032635
O  -1.363362 -0.522199 1.377492
C  -0.848759 -0.459731 -0.020588
C  -1.618523 0.724265 -0.665146
C  -1.164502 -1.792289 -0.745679
C  -1.357804 2.084809 0.008407
C  0.617509 -0.222332 -0.009521
C  1.842207 -0.058385 0.001216
H  -1.349911 0.765712 -1.738005
H  -2.693588 0.469719 -0.599687
H  -0.641821 -2.639513 -0.265912
H  -2.251963 -1.975713 -0.701316
H  -0.848812 -1.751475 -1.803136
H  -1.612313 2.03692 1.080152
H  -0.296109 2.377421 -0.081411
H  -1.97054 2.873862 -0.463902
H  -0.845047 -1.20732 1.873899
