program: Gaussian 09
title: 000211862
version: EM64L-G09RevD.01
frameworkgroup: C1[X(C15H19NO)]
method: RPBEPBE
basis: SDD
operation: Freq
keyword: #p
keyword: freq=noraman
keyword: PBEPBE/SDD
title: #p freq=noraman PBEPBE/SDD
converged: YES YES NO NO
title: Mulliken charges:
elementType: O N C C C C C C C C C C C C C C C H H H H H H H H H H H H H H H H H H H
charge: -0.279092 -0.271442 -0.095453 -0.563289 -0.578433 -0.716372 0.500315 0.366874 -0.422234 -0.399895 -0.402687 0.332413 -0.385887 -0.230188 -0.232479 -0.244886 -0.782143 0.218626 0.197139 0.231060 0.257962 0.226765 0.236424 0.250953 0.192512 0.236660 0.230965 0.230920 0.255483 0.253785 0.222437 0.221919 0.226103 0.239319 0.240405 0.235441
chargesum: 0.00000
title: Mulliken charges with hydrogens summed into heavy atoms:
elementType: O N C C C C C C C C C C C C C C C
charge: -0.279092 -0.013480 0.123173 -0.135089 -0.115245 -0.036247 0.500315 0.366874 -0.191270 -0.168975 -0.147205 0.332413 -0.132101 -0.007751 -0.010559 -0.018783 -0.066978
polarizability: 1.99168947e+02 1.77598798e+00 1.47245669e+02 -1.62642960e+01 9.67803281e+00 1.52615753e+02
1716.lowfreq: -0.0004 -0.0003 0.0004 3.6456 6.9311 13.0123 17.7168 27.7733 31.7479
frequency: 17.5643 27.5614 31.4427 55.4483 61.6688 83.0333 106.0123 124.9842 176.9587 213.6675 234.0037 247.6876 267.2021 286.1178 340.7420 369.3440 386.3045 403.9579 423.8490 462.6215 531.5524 568.1556 592.1471 609.8008 616.8462 618.6268 649.7009 705.4436 732.2423 751.4870 799.7399 811.4367 824.1812 853.2298 853.9974 879.6979 892.5923 904.8813 919.9949 927.2581 960.5901 975.4417 987.3168 989.6880 992.7543 1025.3382 1026.6537 1035.4358 1046.7414 1069.6090 1097.5933 1111.6820 1128.9108 1170.6591 1174.9867 1185.4610 1194.8851 1209.3607 1214.9414 1218.6494 1253.5185 1293.3229 1303.9513 1327.0085 1335.2014 1339.7997 1355.7006 1380.6687 1381.5894 1404.0655 1430.2826 1439.6457 1454.8649 1455.2419 1465.6725 1471.6198 1473.4750 1477.8591 1483.2476 1561.9115 1591.6700 1606.2457 1613.6796 2969.9419 2979.4204 2980.9103 2986.5508 2990.5152 3049.0727 3051.6750 3056.3050 3065.2942 3091.0864 3101.1339 3110.2511 3114.9034 3129.7302 3140.8916 3160.1913 3212.6958 3231.6626 3449.9930
redmass: 4.0232 3.9683 3.7120 3.4960 2.8963 3.5654 1.1844 3.6303 4.4736 1.3407 2.3971 3.0921 3.6203 2.2477 2.5302 2.2234 2.5131 2.8199 1.9209 3.9811 3.0889 3.3080 4.5376 3.5843 2.0553 5.9774 4.3861 1.7910 4.7290 1.8229 1.2767 2.9020 2.2975 1.3603 1.3000 2.2798 1.6528 2.0285 1.6636 4.6368 1.8999 1.3887 1.7767 6.1789 1.3103 1.2669 2.1798 1.8295 1.4562 2.3867 1.7174 3.1043 1.7818 1.0592 3.5041 1.1148 1.7854 1.4637 2.4463 3.8383 1.4483 1.4687 1.3655 1.3462 1.4488 1.4407 1.4572 1.3000 5.3927 1.2457 1.0801 2.1597 1.1671 1.0481 1.0800 1.0924 1.0940 1.0893 2.2334 7.4032 6.0457 6.1777 6.1989 1.0396 1.0712 1.0376 1.0610 1.0719 1.1009 1.1006 1.0983 1.0972 1.0993 1.0975 1.0870 1.0864 1.0908 1.0958 1.1014 1.0938 1.1038 1.0742
irintensity: 0.0203 0.0047 0.0685 0.0857 0.3938 0.2368 0.1411 0.6593 6.2579 0.8913 2.1305 1.9151 1.4476 6.9303 5.5206 0.8483 0.9441 0.0028 9.1834 4.8890 34.0515 22.6394 5.2913 0.7016 70.5043 1.4012 5.3842 47.8686 36.9077 57.3715 66.5155 9.8431 1.5414 0.1253 0.3599 6.9623 1.9168 2.1248 2.9298 6.0006 7.9232 0.0877 7.4596 0.0429 0.0866 28.4046 7.7978 4.6102 6.1711 9.5236 8.7801 37.4012 109.5055 0.6363 18.6597 0.4913 8.3962 21.1815 1.6188 16.4754 1.2714 7.9539 6.4905 1.9537 3.3048 11.0817 2.4009 16.6133 0.9170 8.1798 9.5974 5.2191 29.6504 8.1169 2.3099 17.4757 2.4704 13.1539 14.7058 16.2105 1.3417 12.3610 11.1553 14.9821 8.0148 36.0965 44.0123 36.0464 13.4615 17.2543 19.1394 38.5642 35.0593 13.9159 10.3610 6.6547 11.1337 48.0308 25.7374 8.0758 1.2186 0.6604
temp: 298.150 k
press: 1.00000 atm
elementType: 8 7 6 6 6 6 6 6 6 6 6 6 6 6 6 6 6 1 1 1 1 1 1 1 1 1 1 1 1 1 1 1 1 1 1 1
symmnumber: 1
zpe: 795231.6 jmol-1
zpe.correction: 0.302888 hartree
zpe.thermalcorrener: 0.319881 hartree
zpe.thermalcorrenthalpy: 0.320825 hartree
zpe.thermalcorrgfe: 0.255284 hartree
zpe.sumelectzpe: -711.681002 hartree
zpe.sumelectthermal: -711.664009 hartree
zpe.sumelectthermalent: -711.663065 hartree
zpe.sumelectthermalfe: -711.728606 hartree
dipole: 1.1812 -1.1191 0.5635
dipole: 1.7219
quadrupole: -97.7165 -100.0995 -96.5480
quadrupole: -2.1737 -2.8165 4.7561
quadrupole: 0.4049 -1.9782 1.5733 -2.1737 -2.8165 4.7561
hfenergy: -711.9838902 hartree
pointgroup: C01 [X(C15H19N1O1)]
dipole: -0.5020582 -0.4496854 -0.0683446 debye
polarizability: 198.3205713|-11.8337585|143.1973705|-14.0207957|-4.6837134|157.512426 unknown
InChI: InChI=1S/C15H19NO/c1-12(10-14-6-4-3-5-7-14)16-11-15-9-8-13(2)17-15/h3-9,12,16H,10-11H2,1-2H3
charge 0 multiplicity 1
36 atoms
O  -3.502647 0.5792 0.291267
N  -0.572405 1.733111 0.391191
C  0.399471 0.63674 0.138877
C  1.785239 1.059558 0.726492
C  -1.642271 1.965187 -0.608058
C  -0.051854 -0.742675 0.684504
C  2.928578 0.136945 0.333061
C  -2.6519 0.862344 -0.808929
C  3.465041 -0.811986 1.241311
C  3.476309 0.195537 -0.976475
C  -2.954359 -0.00946 -1.842128
C  -4.338693 -0.499896 -0.08758
C  -4.026609 -0.874258 -1.384866
C  4.513101 -1.679225 0.855621
C  4.522501 -0.668603 -1.368434
C  5.045203 -1.612001 -0.452534
C  -5.327259 -0.971138 0.929285
H  0.512843 0.562179 -0.962124
H  1.694707 1.108348 1.830117
H  1.97455 2.089352 0.371783
H  -0.943969 1.706213 1.350093
H  -1.169206 2.167608 -1.586723
H  -2.168428 2.892872 -0.309566
H  -1.009166 -1.052341 0.231843
H  -0.187486 -0.692635 1.78329
H  0.703029 -1.521047 0.472207
H  3.059307 -0.86804 2.259302
H  3.084987 0.933292 -1.689019
H  -2.468972 -0.035527 -2.816246
H  -4.505412 -1.672919 -1.948436
H  4.915513 -2.402799 1.574103
H  4.934434 -0.603767 -2.382282
H  5.859243 -2.28132 -0.753095
H  -4.827381 -1.318358 1.852634
H  -6.03062 -0.166981 1.215263
H  -5.912821 -1.81021 0.518949
