program: Gaussian 09
title: 000211861
version: EM64L-G09RevD.01
frameworkgroup: C1[X(C16H14F2N2O4)]
method: RPBEPBE
basis: SDD
operation: Freq
keyword: #p
keyword: freq=noraman
keyword: PBEPBE/SDD
title: #p freq=noraman PBEPBE/SDD
converged: YES YES NO NO
title: Mulliken charges:
elementType: F F O O O O N N C C C C C C C C C C C C C C C C H H H H H H H H H H H H H H
charge: -0.186942 -0.195310 -0.244400 -0.264382 -0.262758 -0.242686 0.005203 -0.002228 -0.515773 -0.506449 0.313049 0.295183 -0.472099 -0.437496 0.473334 0.494311 -0.408605 -0.460055 -0.461387 -0.475926 0.329465 0.338207 -0.417479 -0.427784 0.277030 0.263509 0.251262 0.263304 0.252802 0.232473 0.234310 0.265134 0.315049 0.270768 0.258011 0.317485 0.267552 0.264317
chargesum: 0.00000
title: Mulliken charges with hydrogens summed into heavy atoms:
elementType: F F O O O O N N C C C C C C C C C C C C C C C C
charge: -0.186942 -0.195310 -0.244400 -0.264382 -0.262758 -0.242686 0.005203 -0.002228 0.024765 0.008117 0.313049 0.295183 0.013177 0.061949 0.473334 0.494311 -0.093557 -0.189287 -0.203376 -0.158440 0.329465 0.338207 -0.149927 -0.163466
polarizability: 2.36425272e+02 -1.25989485e+01 2.15251790e+02 5.70129121e+00 -9.50247497e+00 1.27211839e+02
1716.lowfreq: -6.3275 -4.3026 0.0004 0.0009 0.0011 1.3631 8.5356 18.8553 23.1265
frequency: 6.5862 18.7814 23.0867 26.2474 36.4965 46.6446 53.8635 68.2614 103.7131 145.2936 165.6709 176.1094 191.3069 218.9389 221.0729 224.0085 243.5227 257.5585 283.3280 299.2330 347.9793 376.7059 410.2762 429.0420 445.7134 466.5839 493.3006 508.7263 513.4100 522.5050 528.9348 533.7654 565.0048 608.4079 621.8142 640.2473 662.1556 701.3592 704.1870 721.5222 732.1662 788.7266 801.8047 870.6228 879.7231 892.5368 895.0661 904.9358 926.6158 931.6198 938.9745 948.1254 949.1534 962.7530 988.0010 994.4677 1003.4174 1007.7598 1025.8732 1061.7861 1114.2857 1130.5168 1132.7251 1139.5461 1141.4577 1146.2761 1189.0646 1222.1157 1230.2145 1236.7823 1253.7804 1254.2068 1303.5974 1313.4497 1318.2250 1324.1731 1339.3432 1342.3337 1359.4783 1362.5621 1422.9681 1423.4566 1428.5929 1442.3332 1442.6101 1452.3169 1460.2287 1465.0698 1554.5205 1556.3854 1589.3285 1593.2516 1629.8507 1648.2119 3005.1809 3011.6817 3019.2931 3043.5569 3076.2840 3082.9155 3098.0189 3122.3040 3132.4376 3154.7183 3155.3952 3157.3288 3159.6414 3172.4238
redmass: 9.3743 6.4160 7.6416 6.8419 8.2424 5.5701 11.0593 5.9838 10.5874 5.4151 6.6150 4.3296 3.9904 4.7712 4.5632 4.5921 5.1447 3.9939 3.9344 3.4430 4.2088 5.5473 3.6382 3.3601 4.2999 4.6181 3.7957 7.4827 7.3442 4.9481 4.2475 3.4645 3.8406 5.9482 6.4548 5.3808 4.5046 3.8047 3.9559 3.4307 3.3153 3.9223 4.1431 3.7579 1.7675 1.4814 1.7129 3.6940 1.6591 1.4935 2.6226 2.0980 2.0490 3.3731 2.0957 2.3282 5.1980 4.1560 2.1682 2.9402 3.2625 2.5484 2.4062 1.8953 2.3207 1.9356 1.3086 1.3097 1.2469 1.2260 2.2470 1.9498 4.1880 1.2781 7.1743 1.5984 1.4339 1.4085 1.6705 1.5152 2.7216 2.4780 1.1134 1.7431 1.3693 2.2401 1.1144 1.0999 6.4158 6.3005 6.5072 6.0394 8.9800 9.3537 1.0599 1.0628 1.0641 1.0595 1.0986 1.1035 1.0970 1.1070 1.0919 1.0911 1.0931 1.0933 1.0958 1.0946
irintensity: 0.0743 0.4265 0.3664 0.1911 0.5488 1.8338 2.1347 0.3963 2.5113 0.5649 3.2706 4.7817 6.0081 0.5968 2.6468 1.5310 7.4920 6.5108 3.3116 3.3255 30.8688 4.8920 22.5744 0.9366 0.9887 2.1832 0.3380 13.4021 14.6664 1.2115 4.4831 3.3201 1.1183 3.6166 2.1015 2.8374 0.3391 19.4000 18.1386 17.4865 32.3025 21.9058 15.5483 76.3941 52.5624 9.7103 8.2192 37.5987 9.9368 0.5766 7.8696 6.3787 28.2425 20.3622 10.4594 17.1076 6.6292 4.0391 7.8239 49.3667 492.6173 1.7749 3.6861 50.0709 131.7242 52.4082 49.8370 18.2864 30.6113 21.1880 53.7960 32.4558 1.9300 0.5223 3.9333 1.8990 15.9484 32.1362 57.4957 39.1177 36.7018 157.1438 32.1825 9.6703 27.0399 4.8191 16.3201 22.2644 16.3497 13.2464 17.4607 28.4937 193.4120 148.4576 30.7205 11.7364 4.5090 22.3516 2.8941 14.1800 5.0304 3.3915 15.3512 4.4735 0.2424 6.0774 25.7856 5.5439
temp: 298.150 k
press: 1.00000 atm
elementType: 9 9 8 8 8 8 7 7 6 6 6 6 6 6 6 6 6 6 6 6 6 6 6 6 1 1 1 1 1 1 1 1 1 1 1 1 1 1
symmnumber: 1
zpe: 726551.5 jmol-1
zpe.correction: 0.276729 hartree
zpe.thermalcorrener: 0.298633 hartree
zpe.thermalcorrenthalpy: 0.299577 hartree
zpe.thermalcorrgfe: 0.219855 hartree
zpe.sumelectzpe: -1226.436411 hartree
zpe.sumelectthermal: -1226.414507 hartree
zpe.sumelectthermalent: -1226.413563 hartree
zpe.sumelectthermalfe: -1226.493285 hartree
dipole: 0.4346 3.8760 0.5445
dipole: 3.9381
quadrupole: -143.2244 -139.5547 -134.4867
quadrupole: 2.3560 7.4394 7.3275
quadrupole: -4.1358 -0.4661 4.6019 2.3560 7.4394 7.3275
hfenergy: -1226.7131394 hartree
pointgroup: C01 [X(C16H14F2N2O4)]
dipole: -1.4027378 0.621861 -0.2149043 debye
polarizability: 209.7617766|2.8956121|241.4176186|-4.2527793|12.8653822|127.7095062 unknown
InChI: InChI=1S/C16H14F2N2O4/c17-13-3-11(5-19-7-13)9-23-15(21)1-2-16(22)24-10-12-4-14(18)8-20-6-12/h3-8H,1-2,9-10H2
charge 0 multiplicity 1
38 atoms
F  4.297751 0.993268 -1.21943
F  -0.476943 -6.609074 -0.09413
O  -0.466467 3.177714 0.843617
O  -2.882635 -1.190194 -1.145291
O  -0.485007 0.903564 0.339623
O  -3.699571 0.109104 0.620777
N  3.860434 4.446359 -0.015526
N  0.486298 -3.116463 0.590459
C  -2.261858 2.38247 -0.535255
C  -2.746683 1.192542 -1.383665
C  -0.996738 2.043697 0.236788
C  -3.163891 0.022174 -0.506676
C  0.770298 2.969201 1.684289
C  -3.15941 -2.439153 -0.380325
C  2.029144 3.055409 0.852109
C  -1.861696 -3.176523 -0.121305
C  2.560947 1.914591 0.197448
C  -1.795036 -4.582732 -0.263964
C  2.719392 4.288126 0.716754
C  -0.691909 -2.487985 0.301685
C  3.734014 2.091683 -0.551505
C  -0.576855 -5.212195 0.039139
C  4.36438 3.34876 -0.64954
C  0.542806 -4.474554 0.464382
H  -3.038126 2.670992 0.19804
H  -2.070369 3.26928 -1.164401
H  -3.626802 1.506545 -1.977089
H  -1.974191 0.85154 -2.091019
H  0.680696 1.99183 2.188203
H  0.710134 3.790439 2.414421
H  -3.845288 -3.036524 -1.00356
H  -3.665243 -2.157265 0.562889
H  2.069421 0.938994 0.261604
H  -2.652689 -5.175128 -0.59959
H  2.345324 5.190998 1.213846
H  -0.68425 -1.39762 0.396078
H  5.279261 3.475501 -1.237584
H  1.489457 -4.97067 0.702206
