program: Gaussian 09
title: 000211853
version: EM64L-G09RevD.01
frameworkgroup: C1[X(C15H24NO3P)]
method: RPBEPBE
basis: SDD
operation: Freq
keyword: #p
keyword: freq=noraman
keyword: PBEPBE/SDD
title: #p freq=noraman PBEPBE/SDD
converged: YES YES NO NO
title: Mulliken charges:
elementType: P O O O N C C C C C C C C C C C C C C C H H H H H H H H H H H H H H H H H H H H H H H H
charge: 1.269687 -0.524939 -0.481672 -0.626063 0.001602 -0.347420 -0.344482 -0.282319 -0.293984 -0.343110 -0.344058 -0.642902 -0.685299 -0.682140 -0.160932 0.453247 -0.296716 -0.453566 -0.185676 -0.338755 0.202505 0.241115 0.217964 0.204556 0.218550 0.214348 0.220593 0.214988 0.189473 0.199044 0.196959 0.193812 0.261839 0.218743 0.215332 0.210056 0.212216 0.218659 0.213831 0.264343 0.249176 0.246284 0.237076 0.248033
chargesum: 0.00000
title: Mulliken charges with hydrogens summed into heavy atoms:
elementType: P O O O N C C C C C C C C C C C C C C C
charge: 1.269687 -0.524939 -0.481672 -0.626063 0.001602 0.096200 0.078039 0.150578 0.141597 0.045408 0.046713 -0.381063 -0.041167 -0.037434 0.103411 0.453247 -0.047540 -0.207282 0.051400 -0.090722
polarizability: 2.80291111e+02 -3.53225429e+01 2.09527278e+02 -9.15254383e+00 -1.90239387e+01 1.59680181e+02
1716.lowfreq: -10.1881 -8.1131 -5.9150 0.0005 0.0008 0.0009 4.5389 13.2455 19.0059
frequency: -2.3704 12.7905 18.2820 21.1959 33.7229 44.7651 59.3339 65.7112 76.5014 88.9253 103.9087 110.2965 133.1509 155.5095 162.0862 175.2116 189.9171 200.3358 229.6892 234.3984 242.1736 257.8923 278.0923 341.6882 378.4511 395.0851 396.1341 407.3176 423.5834 430.9838 479.9849 493.4171 571.6475 613.8100 648.3890 663.6506 712.4146 741.4878 746.2643 781.0875 797.0054 801.5582 803.5017 828.0743 857.3605 897.0241 897.6781 916.6260 925.9623 931.6466 938.9520 940.3309 945.3716 987.2851 1002.3206 1006.5096 1029.8074 1030.9652 1034.1102 1046.0670 1072.4164 1078.1396 1112.8964 1114.5083 1115.0895 1153.7982 1159.5361 1187.7471 1203.8641 1215.7834 1222.3543 1245.1211 1267.3194 1271.2035 1276.9595 1283.3369 1284.1493 1292.9071 1300.4824 1320.7700 1343.8343 1343.9101 1349.8104 1360.1931 1365.3257 1389.0977 1391.6445 1417.4522 1459.7299 1463.2082 1467.4701 1470.9662 1472.3461 1476.1704 1477.5012 1479.5980 1480.2836 1489.5485 1491.2891 1547.7294 1583.4729 1628.9152 2964.5927 2967.7097 2975.9429 2976.3106 2980.5428 2982.8488 2987.9191 2995.5080 3010.7049 3011.9832 3040.3011 3047.5101 3065.9143 3071.1793 3075.1288 3075.3219 3076.7483 3079.9097 3083.6515 3126.8092 3132.7975 3140.9954 3157.1561 3170.3508
redmass: 3.1942 4.0230 4.2721 4.2257 2.7329 2.7364 2.2918 2.9841 3.0386 2.9813 2.4024 2.7098 2.8978 3.2875 3.4726 5.9709 3.5598 2.8242 1.5315 1.1566 2.3722 3.5371 5.7052 4.7287 3.5592 3.3099 2.9338 4.5226 5.9328 5.4344 5.4526 4.1575 7.1798 7.8954 7.9661 8.3242 1.8879 1.0722 1.0716 4.9947 1.4319 1.2195 1.1698 5.2146 1.8677 1.8218 1.8057 1.4405 3.8829 1.7739 1.9409 1.6056 1.4622 1.3418 3.6741 1.2269 3.1299 3.7819 3.8744 13.1843 2.3788 2.4113 2.3955 1.6841 2.3504 1.5840 1.6114 1.1903 1.5236 1.3404 1.3081 2.0647 1.2786 1.2498 1.1311 1.1737 1.0991 1.0770 2.1359 2.8141 1.3910 1.3763 1.2159 1.3878 1.3935 1.2117 1.2109 2.0684 2.1406 1.0811 1.0785 1.0678 1.0618 1.0454 1.0421 1.0640 1.0625 1.0888 1.0885 5.2105 5.6719 6.2023 1.0589 1.0588 1.0361 1.0370 1.0599 1.0614 1.0617 1.0599 1.0998 1.0987 1.1006 1.1018 1.1053 1.1023 1.1004 1.1015 1.1000 1.1044 1.0906 1.0902 1.0896 1.0919 1.0917 1.1000
irintensity: 0.5272 1.5107 1.3158 0.3654 0.6002 0.3961 0.0871 0.9337 2.1089 0.1189 0.2874 0.2759 1.9920 1.0855 6.6199 5.9117 3.9880 9.3279 1.1819 0.5244 2.9450 3.3019 4.4129 13.2818 6.1918 2.0245 5.0338 1.9259 25.0125 46.7934 27.7443 0.8231 10.1359 11.3166 65.7425 184.0907 16.3290 8.7253 9.9436 118.8987 70.8890 25.9500 7.0468 4.3209 5.9377 33.3258 24.8637 0.9503 217.1530 115.4588 76.6263 53.9337 1.0384 9.4095 8.5639 42.5464 2.2006 70.3626 35.1343 91.8093 6.1589 8.7129 4.8006 2.2527 5.7785 0.9578 3.6784 18.4857 4.0783 0.1355 0.8390 7.2173 2.3234 2.4310 0.2730 0.0737 0.2691 1.1480 1.0795 15.4916 1.5056 1.3702 6.0324 19.2702 30.0931 9.0916 10.1685 7.8530 30.1677 0.9271 1.8475 0.8237 0.7607 11.7861 12.9813 3.0922 3.7959 16.1142 17.2717 10.2241 4.9062 42.0176 30.0891 22.4321 41.0304 21.3239 4.6018 11.3948 86.4216 55.0038 13.8068 9.2055 5.0194 2.3242 10.8338 12.9767 35.5584 124.1628 52.2714 94.0567 0.7591 18.2546 3.3777 12.0421 6.5854 26.7724
temp: 298.150 k
press: 1.00000 atm
elementType: 15 8 8 8 7 6 6 6 6 6 6 6 6 6 6 6 6 6 6 6 1 1 1 1 1 1 1 1 1 1 1 1 1 1 1 1 1 1 1 1 1 1 1 1
symmnumber: 1
zpe: 957390.3 jmol-1
zpe.correction: 0.364651 hartree
zpe.thermalcorrener: 0.387747 hartree
zpe.thermalcorrenthalpy: 0.388691 hartree
zpe.thermalcorrgfe: 0.307330 hartree
zpe.sumelectzpe: -1206.048130 hartree
zpe.sumelectthermal: -1206.025034 hartree
zpe.sumelectthermalent: -1206.024089 hartree
zpe.sumelectthermalfe: -1206.105451 hartree
dipole: 0.8136 0.8271 -1.3903
dipole: 1.8108
quadrupole: -119.4687 -115.2495 -140.2458
quadrupole: -10.8010 16.2527 -5.6810
quadrupole: 5.5193 9.7385 -15.2578 -10.8010 16.2527 -5.6810
hfenergy: -1206.4127809 hartree
pointgroup: C01 [X(C15H24N1O3P1)]
dipole: 0.2634649 0.3375818 -0.5693466 debye
polarizability: 288.7270509|-24.3953096|198.6406478|-6.5097116|-21.9820242|162.1308711 unknown
InChI: InChI=1S/C15H24NO3P/c1-3-5-11-18-20(17,19-12-6-4-2)13-9-15-8-7-10-16-14-15/h7-10,13-14H,3-6,11-12H2,1-2H3
charge 0 multiplicity 1
44 atoms
P  -1.360501 0.145419 0.629896
O  -2.312206 -0.015061 -0.820503
O  -1.623295 1.807663 1.098305
O  -1.688183 -0.81427 1.855607
N  4.456114 -0.726564 -1.52449
C  -4.11745 -1.723124 -0.51204
C  -0.219119 3.628753 0.113662
C  -3.783406 -0.235899 -0.683215
C  -1.572817 2.905385 0.093283
C  -5.646162 -1.963312 -0.477494
C  -0.2145 4.856133 -0.829536
C  0.308647 -0.031509 -0.102416
C  -5.999311 -3.457733 -0.316396
C  1.13772 5.60164 -0.819785
C  1.249362 -0.777224 0.541576
C  2.631436 -1.027276 0.099905
C  3.485343 -1.834836 0.901245
C  3.181038 -0.50184 -1.106642
C  4.809598 -2.078935 0.483816
C  5.252916 -1.507526 -0.730718
H  -3.668816 -2.290409 -1.350492
H  -3.65526 -2.092659 0.422846
H  -0.002188 3.95108 1.149884
H  0.589908 2.930575 -0.179457
H  -4.198315 0.1672 -1.624057
H  -4.172582 0.359832 0.16711
H  -2.382156 3.591914 0.401239
H  -1.81148 2.510152 -0.914789
H  -6.106004 -1.573141 -1.408914
H  -6.092053 -1.387959 0.359257
H  -1.023306 5.552548 -0.528675
H  -0.449792 4.531855 -1.86405
H  0.470077 0.47017 -1.061968
H  -5.581141 -3.862582 0.623743
H  -7.093529 -3.613048 -0.296096
H  -5.587131 -4.054288 -1.151782
H  1.959646 4.937582 -1.146911
H  1.120281 6.4762 -1.495278
H  1.383306 5.962878 0.196285
H  0.953885 -1.252637 1.49022
H  3.108176 -2.262222 1.837774
H  2.575236 0.124893 -1.771418
H  5.486529 -2.696867 1.081489
H  6.273691 -1.670656 -1.093625
