program: Gaussian 09
title: 000211837
version: EM64L-G09RevD.01
frameworkgroup: C1[X(C10H15NO3)]
method: RPBEPBE
basis: SDD
operation: Freq
keyword: #p
keyword: freq=noraman
keyword: PBEPBE/SDD
title: #p freq=noraman PBEPBE/SDD
converged: YES YES NO NO
title: Mulliken charges:
elementType: O O O N C C C C C C C C C C H H H H H H H H H H H H H H H
charge: -0.259440 -0.275783 -0.245090 -0.180602 -0.085630 -0.393671 -0.335404 -0.284483 0.232485 -0.352895 -0.673662 -0.315125 0.187511 -0.450211 0.254848 0.236541 0.256802 0.208133 0.243475 0.207725 0.226536 0.225368 0.199848 0.219058 0.223728 0.207470 0.225948 0.218977 0.277542
chargesum: 0.00000
title: Mulliken charges with hydrogens summed into heavy atoms:
elementType: O O O N C C C C C C C C C C
charge: -0.259440 -0.275783 -0.245090 -0.180602 0.169218 0.099671 0.116205 0.149779 0.232485 0.072321 -0.023405 0.129800 0.187511 -0.172669
polarizability: 1.50315556e+02 1.59861963e+01 1.24041170e+02 9.92874059e+00 6.78513105e+00 8.85270886e+01
1716.lowfreq: -5.5306 -1.1653 -0.0005 0.0005 0.0006 11.5194 23.5135 37.9807 48.0982
frequency: 23.4476 37.8711 48.0736 68.4468 78.8761 88.2107 98.4299 129.5977 140.3464 223.0659 228.5988 266.9654 280.1135 301.9686 316.7955 326.6355 370.2199 445.2976 502.6659 547.5677 636.2852 653.8442 681.1775 681.6669 709.5503 746.9598 770.7090 854.0431 871.1591 884.8187 915.7275 925.2714 962.9155 974.3340 983.7466 995.3298 1038.0907 1049.3190 1072.9141 1106.1356 1111.6074 1122.4251 1170.8443 1201.6680 1206.9727 1214.1852 1253.2175 1265.8147 1273.7926 1301.5108 1312.9244 1325.8953 1350.8155 1364.9189 1390.6735 1395.7439 1398.7605 1457.7022 1463.3953 1474.5482 1478.8063 1481.1032 1486.8756 1501.5950 1715.8899 2154.7359 2925.0972 2942.4512 2968.8724 2976.1829 2978.5699 2981.9204 2986.9048 3006.3867 3034.4469 3055.4743 3060.9860 3077.9338 3082.4427 3092.0407 3426.1596
redmass: 4.6378 3.1125 2.7596 4.5384 2.2593 2.6208 5.3581 4.3658 3.2266 4.1810 1.1572 3.1522 3.2131 2.9998 3.1980 4.8605 4.9095 2.6793 6.5193 5.5621 1.2295 5.8961 1.3487 6.7084 6.2168 1.1644 4.3685 2.4746 1.4385 1.8433 6.0732 1.8547 3.8606 3.6727 2.1065 2.0402 8.5399 2.9081 1.9281 2.0513 1.5961 1.8784 1.1887 1.0738 1.7252 1.6914 1.9833 1.5183 1.2909 1.2769 1.3948 1.3410 1.4100 1.3651 1.9059 1.2498 1.4817 1.0798 1.0869 1.0577 1.0765 1.0416 1.0788 1.0914 11.2226 6.0103 1.0549 1.0570 1.1039 1.0602 1.0392 1.0624 1.0632 1.1047 1.0972 1.1002 1.1013 1.1020 1.0994 1.0896 1.1608
irintensity: 0.4912 1.5770 0.9463 4.7404 1.0288 1.6396 5.7893 8.0453 2.4543 8.7732 0.8157 1.4405 3.8901 6.1346 5.4648 2.8896 0.5463 2.8925 1.1111 2.2730 73.6539 23.6344 64.5448 4.8012 10.0109 8.8234 5.8389 14.2804 6.3245 32.1611 26.5862 11.5522 0.9488 128.2121 15.0325 14.4285 211.6847 1.6231 36.8719 8.2999 29.6843 11.8656 19.5510 7.4443 57.0760 8.5506 54.1770 66.7511 7.7015 1.0041 2.0113 55.2272 12.5803 1.7498 26.0239 25.7837 14.2416 11.5035 4.7971 2.0242 12.8823 14.0249 16.7058 16.2898 476.3895 1.7487 38.9142 51.7883 36.8084 15.0696 27.9819 32.8965 64.9374 35.4179 4.1441 15.0176 0.3996 69.5578 39.5940 27.6030 60.3254
temp: 298.150 k
press: 1.00000 atm
elementType: 8 8 8 7 6 6 6 6 6 6 6 6 6 6 1 1 1 1 1 1 1 1 1 1 1 1 1 1 1
symmnumber: 1
zpe: 619124.2 jmol-1
zpe.correction: 0.235812 hartree
zpe.thermalcorrener: 0.251447 hartree
zpe.thermalcorrenthalpy: 0.252392 hartree
zpe.thermalcorrgfe: 0.190402 hartree
zpe.sumelectzpe: -669.312260 hartree
zpe.sumelectthermal: -669.296625 hartree
zpe.sumelectthermalent: -669.295680 hartree
zpe.sumelectthermalfe: -669.357670 hartree
dipole: 2.5751 4.1129 0.0059
dipole: 4.8526
quadrupole: -79.8945 -91.6472 -81.9873
quadrupole: -12.6771 -5.5799 -0.9423
quadrupole: 4.6152 -7.1376 2.5224 -12.6771 -5.5799 -0.9423
hfenergy: -669.548072 hartree
pointgroup: C01 [X(C10H15N1O3)]
dipole: -0.7404663 1.2807152 -1.2067985 debye
polarizability: 144.7166559|-8.4125378|102.1060463|19.3214257|-21.1123523|116.0611124 unknown
InChI: InChI=1S/C10H15NO3/c1-3-5-11-7-9(14-10(11)12)8-13-6-4-2/h2,9H,3,5-8H2,1H3
charge 0 multiplicity 1
29 atoms
O  0.488132 -1.819544 1.428475
O  -2.22042 0.21013 -0.087557
O  2.483879 -1.277345 2.560607
N  1.763852 -0.09894 0.625438
C  -0.305536 -1.164584 0.347352
C  0.711519 -0.253213 -0.392952
C  2.916057 0.800894 0.488784
C  -1.44926 -0.387674 1.011342
C  1.689424 -1.058443 1.626234
C  3.930778 0.360939 -0.594462
C  5.124128 1.336324 -0.675291
C  -3.395895 0.948019 0.416979
C  -4.095581 1.585538 -0.703418
C  -4.71178 2.13798 -1.615849
H  -0.70978 -1.958303 -0.298867
H  1.098335 -0.735798 -1.311633
H  0.249581 0.711108 -0.667549
H  2.548383 1.822411 0.265141
H  3.415742 0.828859 1.474392
H  -1.043448 0.39953 1.684367
H  -2.074049 -1.082457 1.60997
H  4.289328 -0.657902 -0.354139
H  3.428544 0.305356 -1.580592
H  5.66309 1.384343 0.289145
H  5.845642 1.017885 -1.448477
H  4.790255 2.360652 -0.927753
H  -4.080301 0.24777 0.944257
H  -3.070174 1.720607 1.148469
H  -5.244148 2.615457 -2.418612
