program: Gaussian 09
title: 000211836
version: EM64L-G09RevD.01
frameworkgroup: C1[X(C13H12BrNO3)]
method: RPBEPBE
basis: SDD
operation: Freq
keyword: #p
keyword: freq=noraman
keyword: PBEPBE/SDD
title: #p freq=noraman PBEPBE/SDD
converged: YES YES NO NO
title: Mulliken charges:
elementType: Br O O O N C C C C C C C C C C C C C H H H H H H H H H H H H
charge: 0.007304 -0.248488 -0.275803 -0.234159 -0.281127 -0.102728 -0.420822 -0.289506 0.242426 0.430846 -0.332620 -0.342767 -0.175384 -0.185946 -0.315879 -0.232941 0.186874 -0.444964 0.263546 0.257274 0.268749 0.206552 0.230385 0.306093 0.252992 0.251487 0.250027 0.226937 0.222700 0.278942
chargesum: 0.00000
title: Mulliken charges with hydrogens summed into heavy atoms:
elementType: Br O O O N C C C C C C C C C C C C C
charge: 0.007304 -0.248488 -0.275803 -0.234159 -0.281127 0.160817 0.105200 0.147432 0.242426 0.430846 -0.026526 -0.089775 0.076103 0.064081 0.133759 -0.232941 0.186874 -0.166021
polarizability: 2.46204720e+02 -9.76674224e+00 1.77497836e+02 -1.69799355e+01 -2.47152459e+01 9.70269701e+01
1716.lowfreq: -7.0616 -4.0837 -0.0005 -0.0004 0.0004 2.5538 14.4040 30.7556 40.5449
frequency: 14.2333 30.7391 40.5433 59.2954 69.2410 84.5534 101.6627 119.9047 136.4732 184.2944 204.9495 221.7356 243.6673 282.4444 315.8375 336.7865 346.3231 375.3177 410.9870 417.5863 461.9529 512.3671 518.3982 566.1065 624.1377 638.8453 668.6301 676.0197 684.3190 703.5073 715.0364 750.3980 810.3667 842.5572 861.7578 905.1306 916.9947 937.5074 950.5032 966.1522 981.7035 982.8035 988.1543 995.7617 1039.4835 1061.3452 1073.9632 1094.8787 1119.3850 1122.4274 1165.9238 1193.4147 1199.3998 1200.9464 1224.4305 1268.8777 1303.1369 1310.4966 1323.8950 1354.1643 1357.9024 1377.1021 1399.3714 1409.3067 1463.1046 1479.9391 1482.0178 1498.8759 1574.4595 1603.7650 1696.4301 2155.3859 2928.7960 2941.5413 2973.9055 2996.4379 3007.1789 3066.7009 3093.1005 3155.6279 3164.6819 3175.6427 3189.8618 3423.2592
redmass: 6.6301 3.5815 4.1470 4.0923 6.4886 5.1081 6.1148 3.5460 5.2720 6.7945 7.6773 5.0615 6.2830 5.2831 3.1960 5.4470 6.3493 5.8699 2.9952 4.7405 2.9517 2.8812 7.2442 6.0939 7.1846 1.2294 9.2760 10.0766 1.2610 3.6632 6.8419 5.8198 1.3883 1.4016 3.5189 5.1499 6.7548 1.4489 1.5864 3.5956 1.4259 2.0308 4.4227 2.1995 8.9774 4.6510 2.3218 1.9077 1.8318 1.4554 1.3180 2.6244 1.0813 1.1559 1.2782 1.2922 1.4989 1.7460 1.2710 1.5188 2.8090 3.6202 1.4698 3.1739 1.0876 1.1345 2.2075 1.0997 7.6752 5.9542 11.8775 6.0001 1.0549 1.0576 1.1044 1.0620 1.1043 1.1028 1.0901 1.0879 1.0906 1.0966 1.0956 1.1612
irintensity: 0.1532 0.8743 0.6902 1.3271 4.3154 5.7204 0.5651 1.7991 9.8935 1.8639 0.6463 7.6608 8.1956 0.6415 5.6992 3.0872 3.8499 4.1762 0.0607 9.3629 10.3436 27.9121 2.6161 8.8420 0.1614 72.8284 6.8391 7.2566 55.5856 0.1711 4.2511 14.0297 31.1597 53.0085 8.8067 165.6015 21.5154 10.5025 20.6810 1.4869 4.3271 17.3489 24.3790 21.9580 243.5675 169.0685 27.3709 48.2459 20.0498 15.1173 19.4015 144.0356 10.5190 1.4727 20.5576 5.0448 29.0111 111.7830 45.5484 1.9944 125.8350 28.7951 10.9149 9.8145 4.8794 66.7886 282.5620 5.0394 0.5182 28.2922 416.4294 2.8624 36.2690 54.0744 35.9253 20.6017 37.7921 8.4429 28.5292 7.9585 4.1445 6.1722 7.2715 61.1705
temp: 298.150 k
press: 1.00000 atm
elementType: 35 8 8 8 7 6 6 6 6 6 6 6 6 6 6 6 6 6 1 1 1 1 1 1 1 1 1 1 1 1
symmnumber: 1
zpe: 582140.2 jmol-1
zpe.correction: 0.221726 hartree
zpe.thermalcorrener: 0.239127 hartree
zpe.thermalcorrenthalpy: 0.240072 hartree
zpe.thermalcorrgfe: 0.172436 hartree
zpe.sumelectzpe: -795.077957 hartree
zpe.sumelectthermal: -795.060555 hartree
zpe.sumelectthermalent: -795.059611 hartree
zpe.sumelectthermalfe: -795.127247 hartree
dipole: -4.1002 -3.5350 0.3374
dipole: 5.4242
quadrupole: -107.0831 -125.5543 -110.7297
quadrupole: 8.1910 3.3348 -0.7126
quadrupole: 7.3726 -11.0986 3.7260 8.1910 3.3348 -0.7126
hfenergy: -795.2996828 hartree
pointgroup: C01 [X(C13H12Br1N1O3)]
dipole: -1.8127534 -0.994007 0.5291449 debye
polarizability: 241.8049283|-25.6256357|154.9726778|-10.6256395|-45.4763285|123.9519194 unknown
InChI: InChI=1S/C13H12BrNO3/c1-2-7-17-9-12-8-15(13(16)18-12)11-5-3-10(14)4-6-11/h1,3-6,12H,7-9H2
charge 0 multiplicity 1
30 atoms
Br 5.933881 -2.293739 0.705885
O  -0.994369 2.298956 -0.725191
O  -3.353747 -0.425444 0.109059
O  1.138053 2.462015 -1.661803
N  0.582607 0.777685 -0.047969
C  -1.716022 1.308849 0.120565
C  -0.600191 0.461399 0.782706
C  -2.645297 0.494746 -0.788576
C  0.356259 1.881424 -0.88773
C  1.821985 0.091537 0.109348
C  2.955162 0.399318 -0.694559
C  1.92933 -0.929905 1.092604
C  4.162541 -0.305279 -0.515774
C  3.138795 -1.634365 1.269677
C  -4.33931 -1.25126 -0.620635
C  4.247402 -1.317364 0.462057
C  -5.000632 -2.164377 0.316629
C  -5.579363 -2.946455 1.072049
H  -2.309758 1.868618 0.858755
H  -0.427696 0.750838 1.835959
H  -0.859736 -0.610081 0.746157
H  -2.056757 -0.062632 -1.550659
H  -3.34981 1.17585 -1.308969
H  2.891143 1.189483 -1.44495
H  1.081626 -1.187091 1.733574
H  5.0276 -0.060194 -1.138562
H  3.207477 -2.416898 2.030538
H  -5.091754 -0.592245 -1.106143
H  -3.825894 -1.831191 -1.418834
H  -6.080928 -3.625701 1.737893
