program: Gaussian 09
title: 000211819
version: EM64L-G09RevD.01
frameworkgroup: C1[X(C24H21F3N4O6)]
method: RPBEPBE
basis: SDD
operation: Freq
keyword: #p
keyword: freq=noraman
keyword: PBEPBE/SDD
title: #p freq=noraman PBEPBE/SDD
converged: YES YES NO NO
title: Mulliken charges:
elementType: F F F O O O O O O N N N N C C C C C C C C C C C C C C C C C C C C C C C C H H H H H H H H H H H H H H H H H H H H H
charge: -0.188467 -0.188719 -0.188308 -0.268556 -0.269069 -0.269264 -0.267886 -0.266866 -0.267871 -0.106065 -0.027178 -0.025816 -0.025784 -0.318994 -0.320193 -0.319378 -0.310619 -0.309013 -0.309299 0.225064 0.226604 0.227231 0.230086 0.229397 0.229137 -0.352290 -0.355881 -0.355068 -0.402000 -0.401823 -0.398313 0.326186 0.327140 0.325833 -0.408966 -0.408952 -0.408363 0.231140 0.183340 0.231875 0.183489 0.230505 0.184068 0.229733 0.242984 0.229554 0.242989 0.229494 0.242994 0.325722 0.326462 0.327616 0.312721 0.311896 0.308178 0.272269 0.272644 0.272648
chargesum: 0.00000
title: Mulliken charges with hydrogens summed into heavy atoms:
elementType: F F F O O O O O O N N N N C C C C C C C C C C C C C C C C C C C C C C C C
charge: -0.188467 -0.188719 -0.188308 -0.268556 -0.269069 -0.269264 -0.267886 -0.266866 -0.267871 -0.106065 -0.027178 -0.025816 -0.025784 0.095486 0.095171 0.095196 0.162099 0.163530 0.163189 0.225064 0.226604 0.227231 0.230086 0.229397 0.229137 -0.026568 -0.029418 -0.027452 -0.089279 -0.089927 -0.090135 0.326186 0.327140 0.325833 -0.136697 -0.136308 -0.135715
polarizability: 3.86898618e+02 -7.97765506e-01 2.40218051e+02 6.37793839e-01 -6.24523210e-02 2.35443180e+02
1716.lowfreq: -10.3149 -5.5019 -0.0009 -0.0006 0.0005 5.4877 16.5436 19.3754 22.3396
frequency: 14.0188 18.7359 22.2438 27.3789 30.2895 33.7901 42.4185 50.7845 53.7274 68.6948 74.2638 75.8871 83.0511 89.2228 90.5570 124.4172 135.3227 138.4961 181.3047 186.5481 189.2284 218.9449 220.8833 221.4365 223.1836 226.3219 235.2708 281.1813 282.9803 287.0637 307.0012 315.3639 319.0354 348.2707 350.5631 353.7259 381.0021 381.1963 382.1386 434.8145 440.2962 442.9160 457.3074 465.7680 466.2581 487.4798 500.1288 500.6827 502.0865 523.0624 523.4978 532.6747 541.6399 542.4135 641.3316 641.7204 642.9153 689.0220 689.8665 691.0604 700.2327 728.7375 731.9678 734.3144 750.1223 750.6014 752.7064 800.5645 801.3572 813.5070 893.6188 894.9221 896.3979 897.9125 898.6533 911.4616 911.9296 913.2382 930.2580 936.3206 939.4907 939.6354 941.5395 947.5398 986.0534 987.5297 1001.6973 1003.0431 1003.2186 1004.8072 1025.4763 1072.0335 1076.1565 1076.5023 1090.1847 1090.5678 1091.0448 1126.3033 1126.5556 1127.0529 1153.7314 1154.7482 1163.1276 1171.0297 1172.9242 1239.8929 1246.6249 1248.0100 1254.9578 1255.3866 1262.4450 1287.7893 1288.0392 1290.1991 1300.0727 1301.1587 1303.1281 1316.2419 1316.7592 1317.3350 1358.9405 1359.5830 1362.2623 1383.6619 1385.0805 1385.7102 1412.3994 1412.6488 1413.7177 1438.4734 1439.0313 1439.9155 1446.8578 1449.6087 1457.8209 1473.7192 1476.5565 1478.1342 1547.3217 1547.8851 1548.0354 1585.5987 1587.2414 1587.4268 1612.9027 1620.7325 1621.2437 2831.1726 2832.8836 2845.6515 3022.8192 3025.3972 3025.7815 3058.7897 3060.2491 3061.4396 3090.6965 3093.7704 3094.5970 3158.2067 3158.3052 3158.7359 3172.1576 3172.9026 3175.8288 3183.4289 3185.6024 3185.7693
redmass: 7.1668 9.4788 8.4984 7.4556 7.9271 11.3091 9.2223 9.7071 9.6823 9.2700 9.3836 9.0466 7.5296 6.8030 6.9078 5.6209 5.5522 5.6665 5.9301 4.7825 5.0746 4.9706 4.5265 5.2992 4.7599 4.2769 6.3879 3.9411 3.9216 4.2767 2.6905 3.0725 3.0231 3.5773 2.9338 2.8474 7.8217 7.7132 7.7014 4.3732 4.9456 4.9491 4.3340 6.4007 6.3583 3.8433 5.2228 5.0733 4.6708 5.1308 5.2408 6.5157 3.6750 3.5804 9.7331 9.7554 9.3634 3.4549 3.4194 3.4060 3.0223 3.9388 4.0197 4.1651 7.6624 7.6815 7.5835 3.8728 3.8715 4.3889 1.6441 1.7063 2.0691 2.1732 1.8517 3.2689 3.1595 4.4145 1.4150 1.3996 1.3985 1.5002 1.4928 1.4651 3.0267 2.9769 3.4090 5.1716 5.2247 3.4921 2.0325 2.5159 2.4820 2.5025 2.8050 2.7466 2.7584 2.8770 2.8647 2.9039 2.5105 2.4955 2.8942 2.6929 2.6596 1.1143 1.2464 1.2559 2.3631 2.3379 2.4715 1.1379 1.2534 1.2210 1.4922 1.5313 1.6232 5.4661 5.0374 4.2925 1.3810 1.3481 1.3547 1.3443 1.3415 1.3345 2.8596 2.8560 2.8780 2.5583 2.4927 2.5030 1.0977 1.0963 1.1181 1.0974 1.0957 1.0948 6.7465 6.7580 6.7135 6.5711 6.4128 6.3635 10.2766 10.4339 10.4726 1.0721 1.0720 1.0699 1.0584 1.0584 1.0581 1.0860 1.0880 1.0877 1.1055 1.1050 1.1042 1.0926 1.0926 1.0925 1.0942 1.0941 1.0940 1.0940 1.0938 1.0940
irintensity: 0.3604 0.0161 0.0935 0.3953 0.1556 0.0044 0.3335 0.9918 0.7965 0.5485 1.4366 0.9707 0.2358 0.3949 0.3272 0.4147 0.8499 0.9585 0.1726 5.0054 4.8080 4.6423 1.3744 6.4422 3.3062 0.8003 1.3374 3.2315 3.0263 4.7662 7.4995 3.5717 3.6442 16.6142 4.9848 4.9002 11.6763 7.9836 8.6504 2.3200 2.9158 2.9129 6.0614 0.9898 1.0527 0.0912 0.0441 0.0848 0.0141 13.5739 12.4836 8.8517 10.4381 10.5299 1.2863 1.2190 0.5915 8.6139 12.8409 11.2293 20.7609 80.0767 73.9741 13.9024 0.8904 1.2200 5.2880 0.5950 0.6023 7.4928 23.4112 31.7710 24.9398 13.5770 36.6539 9.9816 6.8791 191.3019 35.0772 35.0879 3.6845 35.0402 7.9412 12.0245 3.9941 3.4449 0.2831 7.3178 7.1530 18.9340 98.1429 7.8159 0.5721 1.2160 25.7603 125.6040 154.1189 45.9879 64.9963 47.6786 0.7859 2.2254 135.0932 7.6975 7.9154 1.2307 9.9214 9.5444 21.8601 20.1050 754.5130 21.7430 7.1364 10.2224 1.7520 0.3353 23.1330 3.3622 3.2863 0.5737 23.4274 6.2602 12.9094 3.5425 3.8980 7.2768 10.0735 19.4026 202.0345 59.1893 26.5731 24.5581 0.3160 0.6148 3.6667 24.2113 29.6289 32.7437 20.6309 11.6268 11.7644 2.2680 5.9158 5.6018 6.4951 236.0535 248.5298 39.5332 40.1717 306.4714 38.1549 18.0666 81.0766 5.2997 11.9903 12.7602 8.2904 14.9078 21.6334 1.8857 5.7179 6.1297 10.8866 8.9080 8.5679 1.6844 1.3021 1.2475
temp: 298.150 k
press: 1.00000 atm
elementType: 9 9 9 8 8 8 8 8 8 7 7 7 7 6 6 6 6 6 6 6 6 6 6 6 6 6 6 6 6 6 6 6 6 6 6 6 6 1 1 1 1 1 1 1 1 1 1 1 1 1 1 1 1 1 1 1 1 1
symmnumber: 1
zpe: 1107732.7 jmol-1
zpe.correction: 0.421913 hartree
zpe.thermalcorrener: 0.455550 hartree
zpe.thermalcorrenthalpy: 0.456494 hartree
zpe.thermalcorrgfe: 0.352590 hartree
zpe.sumelectzpe: -1894.318375 hartree
zpe.sumelectthermal: -1894.284738 hartree
zpe.sumelectthermalent: -1894.283793 hartree
zpe.sumelectthermalfe: -1894.387697 hartree
dipole: 7.9849 0.0270 0.0149
dipole: 7.9850
quadrupole: -180.6241 -222.7337 -222.0875
quadrupole: 0.0007 -0.0773 0.1097
quadrupole: 27.8577 -14.2520 -13.6057 0.0007 -0.0773 0.1097
hfenergy: -1894.7402877 hartree
pointgroup: C01 [X(C24H21F3N4O6)]
dipole: -3.1373125 -0.1442065 -0.0752477 debye
polarizability: 386.4184499|8.0283687|238.1059692|2.9559429|-2.2266925|238.0354293 unknown
InChI: InChI=1S/C24H21F3N4O6/c25-19-7-16(10-28-13-19)22(32)35-4-1-31(2-5-36-23(33)17-8-20(26)14-29-11-17)3-6-37-24(34)18-9-21(27)15-30-12-18/h7-15H,1-6H2
charge 0 multiplicity 1
58 atoms
F  3.817377 1.891046 -2.464425
F  4.024311 -2.741976 -0.051877
F  3.75403 1.469335 2.697265
O  -2.147276 2.176053 -1.382804
O  -1.897102 -2.36938 -1.32768
O  -2.110472 -0.089233 2.588792
O  -1.233604 0.867996 -3.092198
O  -1.088944 -3.1829 0.709914
O  -1.376148 2.108526 2.275515
N  -3.724729 -0.174729 -0.076266
N  1.553172 3.346923 0.054342
N  1.877434 -1.46294 -2.762397
N  1.728736 -1.604387 2.902077
C  -4.222821 1.152254 -0.520282
C  -4.076645 -1.24778 -1.0413
C  -4.177453 -0.497701 1.301165
C  -3.519388 1.740656 -1.748619
C  -3.299416 -2.55875 -0.876433
C  -3.524369 0.330741 2.413709
C  -1.08767 1.650876 -2.121051
C  -0.882997 -2.696843 -0.429341
C  -1.128718 0.893923 2.47611
C  0.229097 2.140802 -1.614675
C  0.467255 -2.404292 -0.996575
C  0.24159 0.321527 2.633555
C  1.401358 1.778906 -2.326659
C  1.608363 -2.751753 -0.229261
C  1.34762 1.209069 2.605653
C  0.350115 2.92272 -0.434656
C  0.646474 -1.765523 -2.25282
C  0.476495 -1.071508 2.783445
C  2.622413 2.230128 -1.80897
C  2.859439 -2.434099 -0.773723
C  2.621362 0.639599 2.731163
C  2.682923 3.003446 -0.631662
C  2.977737 -1.795956 -2.025524
C  2.795313 -0.751904 2.876807
H  -4.093924 1.87063 0.306953
H  -5.320449 1.122861 -0.754809
H  -3.881578 -0.879123 -2.062524
H  -5.168405 -1.505024 -0.992923
H  -3.9538 -1.558186 1.506965
H  -5.28822 -0.375789 1.410165
H  -4.05038 2.655095 -2.066913
H  -3.451569 1.044208 -2.601258
H  -3.731787 -3.323361 -1.545966
H  -3.287707 -2.946416 0.156268
H  -4.024763 0.110461 3.373234
H  -3.548581 1.418417 2.231693
H  1.351961 1.151306 -3.22154
H  1.50891 -3.222477 0.753682
H  1.209169 2.285724 2.466131
H  -0.533552 3.191001 0.148965
H  -0.21537 -1.464558 -2.853082
H  -0.355098 -1.779962 2.783433
H  3.643149 3.344388 -0.23072
H  3.959947 -1.544582 -2.439133
H  3.795489 -1.188182 2.967864
