program: Gaussian 09
title: 000211812
version: EM64L-G09RevD.01
frameworkgroup: C1[X(C9H14N4O3)]
method: RPBEPBE
basis: SDD
operation: Freq
keyword: #p
keyword: freq=noraman
keyword: PBEPBE/SDD
title: #p freq=noraman PBEPBE/SDD
converged: YES YES NO NO
title: Mulliken charges:
elementType: O O O N N N N C C C C C C C C C H H H H H H H H H H H H H H
charge: -0.285081 -0.169581 -0.276828 -0.204428 -0.118289 -0.010278 0.079537 0.501905 -0.516641 -0.519793 0.127213 0.280672 -0.440236 -0.664448 -0.632001 -0.670101 0.288783 0.247113 0.272436 0.234348 0.273615 0.231098 0.231791 0.207150 0.240158 0.228392 0.284542 0.232544 0.241785 0.304622
chargesum: 0.00000
title: Mulliken charges with hydrogens summed into heavy atoms:
elementType: O O O N N N N C C C C C C C C C
charge: -0.285081 -0.169581 -0.276828 -0.204428 -0.118289 -0.010278 0.079537 0.501905 0.019255 -0.013009 0.127213 0.280672 -0.166621 0.005592 0.121091 0.108850
polarizability: 1.68077569e+02 -1.50356206e+01 1.65156479e+02 -1.81282558e+01 4.00584560e-01 9.94391244e+01
1716.lowfreq: -8.0201 -4.0049 -0.0007 0.0009 0.0010 5.6069 22.8647 35.5795 58.7160
frequency: 22.6750 35.3483 58.6894 69.4834 81.1601 85.8945 104.3103 128.8605 156.2464 173.6262 196.8624 219.1537 237.3536 255.7853 299.5247 342.7385 364.7434 372.7905 398.1870 423.7747 451.4587 525.1883 551.4270 599.6728 626.6337 659.5325 689.4479 698.1600 732.8332 760.0801 790.3612 814.2581 844.7724 894.9676 943.7633 964.4449 1007.8868 1050.3055 1057.0270 1061.2880 1093.1977 1135.8551 1138.1907 1144.2107 1162.9016 1203.7451 1233.6201 1240.9023 1259.6869 1292.5305 1317.1784 1328.8924 1350.7667 1353.4891 1377.5230 1387.5198 1393.1964 1415.3677 1417.2260 1441.6287 1453.1476 1474.0095 1476.4571 1480.8673 1486.3743 1491.9000 1494.7411 1505.7306 1518.4505 1603.6086 2978.1511 2982.7153 2983.5266 3014.0359 3041.7067 3060.3506 3060.5382 3076.8883 3081.3405 3093.4430 3110.9267 3124.4097 3153.8727 3230.4603
redmass: 5.5253 5.0335 4.0783 4.6671 2.0142 2.5885 3.0101 1.9459 1.2180 1.5586 2.7510 3.9397 2.7993 2.8250 6.1370 2.9218 4.8487 3.2168 3.2313 3.8981 4.2178 3.3488 5.3123 5.1631 8.1632 5.0204 7.1338 4.4490 4.8763 4.5820 1.4034 5.7591 1.4375 3.5131 3.1076 2.3608 2.6350 1.6465 1.4966 1.7787 1.2273 2.0333 1.5029 4.4298 2.3521 2.2190 1.5744 4.3374 1.9315 2.2843 1.6439 1.3997 8.2923 3.3142 4.9627 3.1458 1.3036 1.4584 1.8714 1.2267 1.2215 1.0453 1.0861 1.0879 1.0938 1.0927 1.0798 1.1146 4.1561 6.2447 1.0356 1.0361 1.0382 1.0611 1.0669 1.1023 1.0999 1.0970 1.1002 1.1009 1.1009 1.0984 1.0943 1.0988
irintensity: 2.9271 1.3865 2.4704 2.7303 2.8021 3.0417 1.4944 0.5284 0.0451 0.2155 0.1041 0.6258 0.7022 5.7817 1.1596 5.4698 7.5597 3.5939 9.4882 1.4812 3.2713 2.1969 7.4021 5.5274 12.0784 2.2064 0.9536 5.4527 10.5170 15.8817 4.9004 2.0902 27.3416 10.6275 4.7350 7.6927 15.9340 1.7056 10.8524 34.5116 1.0414 55.6813 4.6017 191.6899 38.5497 4.9025 53.4546 34.9467 20.6982 18.8087 26.3722 6.1565 240.0256 117.2866 60.4971 50.6302 9.7684 24.6957 49.3150 7.4755 18.1000 12.0237 9.4009 5.6305 19.5739 13.0883 4.9552 42.7499 32.4943 273.9165 39.2300 27.2767 70.8786 10.4206 12.1353 29.6920 6.3253 15.8298 44.3830 29.9517 7.1440 1.4124 1.3860 3.7486
temp: 298.150 k
press: 1.00000 atm
elementType: 8 8 8 7 7 7 7 6 6 6 6 6 6 6 6 6 1 1 1 1 1 1 1 1 1 1 1 1 1 1
symmnumber: 1
zpe: 618565.0 jmol-1
zpe.correction: 0.235599 hartree
zpe.thermalcorrener: 0.252445 hartree
zpe.thermalcorrenthalpy: 0.253389 hartree
zpe.thermalcorrgfe: 0.189308 hartree
zpe.sumelectzpe: -794.717446 hartree
zpe.sumelectthermal: -794.700600 hartree
zpe.sumelectthermalent: -794.699656 hartree
zpe.sumelectthermalfe: -794.763737 hartree
dipole: -2.7664 -6.0711 3.2297
dipole: 7.4123
quadrupole: -77.9489 -111.2761 -95.4716
quadrupole: -9.8298 -0.7133 -2.4741
quadrupole: 16.9500 -16.3772 -0.5728 -9.8298 -0.7133 -2.4741
hfenergy: -794.9530453 hartree
pointgroup: C01 [X(C9H14N4O3)]
dipole: 1.7250008 2.144005 0.9653941 debye
polarizability: 159.7212673|-10.778756|170.429909|18.9081965|-15.9561808|102.5219955 unknown
InChI: InChI=1S/C9H14N4O3/c1-4-7-5-10-9(13(15)16)12(7)6-8(14)11(2)3/h5H,4,6H2,1-3H3
charge 0 multiplicity 1
30 atoms
O  1.655604 1.064879 -1.367426
O  -1.636208 -3.092742 0.402792
O  0.272541 -2.137802 1.222657
N  -0.59222 0.416003 0.278885
N  3.016093 -0.133108 0.10647
N  -2.481568 -0.595994 -0.525744
N  -0.881415 -2.073277 0.601256
C  -1.357952 1.411588 -0.336854
C  0.747941 0.634124 0.8544
C  -0.972189 2.862037 -0.407056
C  -1.313195 -0.785558 0.12284
C  1.846668 0.513921 -0.235135
C  -2.5154 0.75524 -0.812301
C  -1.299834 3.655763 0.888939
C  4.1102 -0.182798 -0.88527
C  3.240625 -0.825021 1.396846
H  0.888422 -0.060768 1.688725
H  0.786372 1.669506 1.235467
H  0.099214 2.946673 -0.663001
H  -1.526571 3.310301 -1.25092
H  -3.352079 1.196853 -1.348916
H  -2.378792 3.609722 1.118626
H  -1.01687 4.716372 0.766694
H  -0.754969 3.259663 1.765966
H  4.316942 -1.228981 -1.177977
H  5.031784 0.261006 -0.465349
H  3.799606 0.3855 -1.774545
H  3.297233 -0.113533 2.242312
H  4.204855 -1.35437 1.341671
H  2.452164 -1.570799 1.590646
