program: Gaussian 09
title: 000211793
version: EM64L-G09RevD.01
frameworkgroup: C1[X(C14H10ClF3N2)]
method: RPBEPBE
basis: SDD
operation: Freq
keyword: #p
keyword: freq=noraman
keyword: PBEPBE/SDD
title: #p freq=noraman PBEPBE/SDD
converged: YES YES NO NO
title: Mulliken charges:
elementType: Cl F F F N N C C C C C C C C C C C C C C H H H H H H H H H H
charge: -0.073652 -0.164688 -0.166133 -0.174991 -0.160874 -0.643258 0.328790 0.278088 -0.496870 0.373028 0.152091 -0.410064 -0.385734 -0.182067 0.239148 -0.263311 -0.334906 -0.227329 -0.235197 -0.217134 0.292213 0.266533 0.255345 0.234914 0.300251 0.260412 0.239394 0.241702 0.351095 0.323205
chargesum: 0.00000
title: Mulliken charges with hydrogens summed into heavy atoms:
elementType: Cl F F F N N C C C C C C C C C C C C C C
charge: -0.073652 -0.164688 -0.166133 -0.174991 -0.160874 0.031041 0.328790 0.278088 -0.204657 0.373028 0.152091 -0.143531 -0.130390 0.052847 0.239148 -0.263311 -0.034655 0.033083 0.004197 0.024568
polarizability: 2.87278430e+02 1.43471931e+01 1.84093483e+02 -2.25659939e+01 5.93818258e+00 9.78939647e+01
1716.lowfreq: -6.5640 -0.0013 -0.0012 0.0004 3.3536 4.2661 11.9839 17.6535 33.5929
frequency: 10.5663 16.4560 33.5883 49.8379 57.5975 110.8393 129.1818 154.4476 185.2420 205.4041 220.2396 279.2213 305.0377 318.1632 338.6530 345.4478 367.9997 404.5829 430.2497 445.6524 470.9699 475.9980 488.4545 522.9456 540.1307 562.8324 569.7698 604.1915 612.4565 637.7663 667.0055 675.4698 694.1096 704.7198 732.4117 774.4220 777.7526 807.1237 855.8776 881.8770 893.6790 913.2361 971.1627 977.0858 981.3170 985.1769 1001.3135 1005.8450 1007.8982 1035.2582 1054.8237 1070.7886 1097.4593 1108.0655 1144.7872 1171.8048 1178.5236 1225.3129 1255.6870 1296.8633 1304.6140 1358.8604 1373.0876 1376.6640 1421.7630 1427.0316 1461.7310 1477.0039 1562.8308 1584.0880 1591.8271 1606.0085 1608.9323 1640.7586 3142.5527 3142.5958 3144.3599 3156.8252 3164.6862 3168.3270 3179.3690 3181.1125 3503.5499 3645.1831
redmass: 8.1668 17.4004 7.0533 5.5881 6.6400 4.9414 6.5372 7.0418 7.3369 6.9428 6.1764 5.9047 7.1211 8.4706 6.4283 7.6194 6.2687 5.4143 5.0203 2.7611 2.7847 5.8572 3.8050 6.1350 1.7856 3.2398 1.4789 8.6920 6.5776 6.3471 4.9148 6.1008 2.4712 5.4872 3.6172 1.5892 2.5791 1.6232 6.6964 1.3704 1.4861 1.4036 1.3566 6.6286 5.8763 1.4387 7.2008 5.8736 1.3590 2.8214 3.4273 1.8239 1.7414 1.9747 1.7554 1.0613 1.0910 2.3398 1.4826 2.1551 2.0812 5.4585 6.3780 3.3979 2.7533 3.5293 2.6867 2.7229 6.2795 5.9475 4.0432 6.5300 5.5650 1.4422 1.0871 1.0864 1.0920 1.0904 1.0940 1.0950 1.1002 1.0973 1.0455 1.1045
irintensity: 0.3638 0.0255 0.2713 1.9524 2.4994 0.5068 0.0247 5.4244 1.4177 1.3155 1.2421 3.4866 0.8318 3.8301 8.2318 5.6991 1.5236 5.5251 0.8345 2.3107 11.2966 13.6982 0.3491 2.4808 34.5444 55.1229 124.0360 14.0666 13.1950 5.4347 19.2512 5.6399 14.1607 17.4391 13.0381 84.5213 6.1020 70.9993 108.8008 2.5489 16.3090 8.4794 3.1820 171.7379 27.5265 10.7489 33.6432 173.3822 6.7351 21.5794 35.4447 82.3748 12.7490 8.0069 2.6761 5.5280 0.2471 122.6877 7.2097 119.9796 168.9077 34.7525 38.2168 55.6246 36.1339 103.6205 6.9811 10.1357 37.8309 120.5199 401.7360 29.6354 64.1601 250.0312 13.2232 0.7430 1.8512 3.9309 7.8751 7.6383 17.7751 5.2681 78.0263 123.9806
temp: 298.150 k
press: 1.00000 atm
elementType: 17 9 9 9 7 7 6 6 6 6 6 6 6 6 6 6 6 6 6 6 1 1 1 1 1 1 1 1 1 1
symmnumber: 1
zpe: 550668.3 jmol-1
zpe.correction: 0.209738 hartree
zpe.thermalcorrener: 0.227386 hartree
zpe.thermalcorrenthalpy: 0.228330 hartree
zpe.thermalcorrgfe: 0.160368 hartree
zpe.sumelectzpe: -1407.180459 hartree
zpe.sumelectthermal: -1407.162811 hartree
zpe.sumelectthermalent: -1407.161867 hartree
zpe.sumelectthermalfe: -1407.229829 hartree
dipole: -4.5051 2.1458 -1.8715
dipole: 5.3294
quadrupole: -114.8874 -116.2702 -123.4982
quadrupole: 6.5855 -10.0836 1.4646
quadrupole: 3.3312 1.9484 -5.2796 6.5855 -10.0836 1.4646
hfenergy: -1407.3901975 hartree
pointgroup: C01 [X(C14H10Cl1F3N2)]
dipole: -1.8248355 0.8689 -0.5579779 debye
polarizability: 284.4090817|28.8673003|176.4100149|-7.1520027|31.3410535|108.4467804 unknown
InChI: InChI=1S/C14H10ClF3N2/c15-12-7-2-1-6-11(12)13(19)20-10-5-3-4-9(8-10)14(16,17)18/h1-8H,19H2
charge 0 multiplicity 1
30 atoms
Cl -3.223931 -2.502108 -1.784761
F  5.387295 -0.381229 0.201569
F  3.88859 -1.461528 1.517563
F  3.842715 -1.764361 -0.722983
N  -0.65121 0.939747 0.141861
N  -0.791953 -0.643367 -1.639299
C  3.072893 0.377755 0.139973
C  0.73804 1.145757 0.034772
C  1.688385 0.091057 0.159666
C  -2.798491 -0.081013 -0.25974
C  -1.331053 0.06717 -0.584519
C  3.548289 1.699601 -0.006167
C  1.224373 2.481819 -0.094032
C  2.605983 2.748109 -0.120627
C  4.031966 -0.768288 0.282535
C  -3.704712 -1.083912 -0.696888
C  -3.345913 0.913929 0.605143
C  -5.061981 -1.104805 -0.313846
C  -4.694065 0.915026 0.999473
C  -5.564095 -0.09891 0.536059
H  1.343821 -0.937846 0.312153
H  4.62225 1.902756 -0.021351
H  0.492903 3.293009 -0.164442
H  2.956472 3.780287 -0.22484
H  -2.643563 1.676681 0.953511
H  -5.711969 -1.904909 -0.678459
H  -5.065494 1.702127 1.66321
H  -6.618455 -0.115155 0.830445
H  0.194527 -0.522405 -1.867072
H  -1.344816 -1.307096 -2.178707
