program: Gaussian 09
title: 000211788
version: EM64L-G09RevD.01
frameworkgroup: C1[X(C7H10N4O3)]
method: RPBEPBE
basis: SDD
operation: Freq
keyword: #p
keyword: freq=noraman
keyword: PBEPBE/SDD
title: #p freq=noraman PBEPBE/SDD
converged: NO YES NO NO
title: Mulliken charges:
elementType: O O O N N N N C C C C C C C H H H H H H H H H H
charge: -0.274387 -0.155339 -0.283715 -0.189823 -0.009467 -0.353318 0.084172 -0.536692 0.426607 0.140056 -0.413014 0.248830 -0.779705 -0.606892 0.252340 0.284991 0.274987 0.299702 0.246368 0.241384 0.362244 0.235826 0.270037 0.234808
chargesum: 0.00000
title: Mulliken charges with hydrogens summed into heavy atoms:
elementType: O O O N N N N C C C C C C C
charge: -0.274387 -0.155339 -0.283715 -0.189823 -0.009467 0.008926 0.084172 0.000638 0.426607 0.140056 -0.138027 0.248830 0.007749 0.133779
polarizability: 1.32376183e+02 3.37727159e+00 1.59340669e+02 1.20000258e+01 -2.68440816e+00 7.57355854e+01
1716.lowfreq: -13.4472 -9.6428 -7.1975 -0.0004 -0.0004 0.0002 32.2211 57.0982 78.2477
frequency: 31.9872 57.0776 78.2160 86.5077 108.6386 141.1358 153.2138 192.7289 204.3141 228.4622 275.5133 301.1891 308.1921 363.1724 410.1858 443.8836 535.9443 565.3539 621.6314 645.9424 650.4624 690.7419 701.6162 758.5725 788.4474 798.3020 842.0901 848.9794 902.6350 976.3129 1000.1984 1050.3631 1080.6939 1120.1699 1129.9212 1146.4594 1149.9541 1198.9654 1233.3783 1269.1094 1297.3925 1331.0731 1348.8973 1353.8823 1373.2720 1399.5099 1413.8650 1421.0874 1456.1447 1466.3789 1468.0030 1483.7781 1485.5076 1522.8438 1542.8364 1639.2520 2977.6374 2987.1617 3060.4474 3066.9470 3069.0063 3108.3467 3116.0234 3135.1167 3232.9271 3406.8905
redmass: 6.4541 5.5074 1.2454 3.2600 4.2471 4.1584 1.1129 4.1018 6.8901 3.9992 5.3211 4.1460 4.6483 4.8571 8.5058 2.1822 4.7044 6.0460 10.8424 3.8583 4.5390 11.2082 5.5836 9.4281 1.1195 6.9192 1.3355 2.8709 3.1660 2.4477 1.6489 1.4871 4.1636 1.3066 4.9767 2.8153 1.7743 2.3002 2.4132 2.3825 2.9564 1.4907 3.0017 6.5812 8.5160 3.0822 1.3042 1.1745 1.1334 1.0813 1.0889 1.0472 1.2534 3.7360 1.5721 6.4691 1.0408 1.0346 1.0943 1.0596 1.1020 1.0983 1.0994 1.1065 1.0991 1.0809
irintensity: 4.7035 3.8368 1.0834 5.0740 8.5493 4.6855 0.0818 2.3900 1.4019 1.5655 0.7600 7.0436 10.4000 3.8267 1.1321 6.9602 2.3578 8.7359 6.5451 7.8487 1.0509 1.1203 1.4896 22.5718 160.1202 1.2110 24.8914 7.1751 10.7859 4.6017 5.4067 13.5305 4.5093 0.1421 164.6330 12.1984 69.3325 6.1382 23.4167 42.2062 52.8267 9.1702 74.0727 280.2771 77.4106 17.9903 52.1497 17.6363 43.5516 8.5064 39.6018 18.0393 3.0589 48.3360 123.5773 204.9443 12.9255 52.7116 7.6215 6.3338 30.0571 6.2979 3.6683 0.4362 2.8440 144.2355
temp: 298.150 k
press: 1.00000 atm
elementType: 8 8 8 7 7 7 7 6 6 6 6 6 6 6 1 1 1 1 1 1 1 1 1 1
symmnumber: 1
zpe: 474049.5 jmol-1
zpe.correction: 0.180556 hartree
zpe.thermalcorrener: 0.194311 hartree
zpe.thermalcorrenthalpy: 0.195256 hartree
zpe.thermalcorrgfe: 0.138986 hartree
zpe.sumelectzpe: -716.288056 hartree
zpe.sumelectthermal: -716.274300 hartree
zpe.sumelectthermalent: -716.273356 hartree
zpe.sumelectthermalfe: -716.329626 hartree
dipole: 2.0407 3.0631 0.8634
dipole: 3.7806
quadrupole: -94.2267 -82.1633 -78.2064
quadrupole: -18.8880 -3.7193 2.1759
quadrupole: -9.3612 2.7022 6.6590 -18.8880 -3.7193 2.1759
hfenergy: -716.4686118 hartree
pointgroup: C01 [X(C7H10N4O3)]
dipole: 0.5830975 -1.3313826 -0.3158307 debye
dipolederiv: -0.6746828 0.2520307 -0.0306524 0.0627624 -0.9549511 -0.1269125 -0.156133 0.1082159 -0.3542396 -0.5548415 0.3794966 0.0668539 0.299185 -0.9120814 0.0066706 0.1349246 -0.0966055 -0.2037434 -0.9157513 -0.265967 0.2624454 -0.0840969 -0.5704889 0.0741145 0.2343959 0.217785 -0.4069301 -0.4158916 -0.11441 0.2025535 -0.028374 0.1793926 -0.0302329 0.1755518 -0.0330858 -0.2693265 -0.3654168 0.3554335 0.0288431 0.0558348 0.2396046 -0.1020445 0.1461307 -0.2582477 -0.2123826 -0.7315332 -0.2296063 -0.0584228 -0.1816282 -0.7831943 -0.118817 -0.1486365 -0.1379158 -0.4684979 1.0987803 0.0233635 -0.3533191 -0.093947 1.9794271 -0.2446429 -0.4413254 -0.2934925 0.3693928 0.0507596 0.0716301 -0.1438317 0.0133481 0.1311785 0.0134521 -0.2275393 0.0467553 0.2389602 0.1425967 -0.5661654 -0.0122654 0.1171256 0.3388601 -0.0487184 -0.0913005 0.4574509 0.0406689 0.2492285 -0.4317538 -0.0741334 -0.2141393 -0.915957 0.25632 -0.0973209 0.4005021 0.1082755 0.047083 0.4711335 -0.2061041 0.0136994 -0.5104536 0.0469414 -0.1655376 -0.3188665 -0.0064644 0.8483081 -0.0902172 0.2482204 0.1832406 1.3765841 0.2399403 0.4609392 0.0178463 0.1950607 -0.0090017 0.1339597 -0.0006282 0.0047563 -0.1792459 0.0030318 0.0075327 -0.1377969 0.0632245 0.4027544 0.1786092 0.0534081 0.0308995 0.0555141 -0.0158539 0.0951476 0.0893192 0.2767771 0.0156627 -0.0135628 -0.001067 0.0110762 -0.0062146 -0.1162785 0.0031561 -0.0353557 0.0689277 0.0425049 0.0082944 -0.0159712 -0.0107247 0.037754 0.1205388 -0.0059738 0.0144002 0.0850948 0.0964218 -0.0480545 0.0650255 -0.0356354 0.049469 0.0406401 0.0686066 0.0431844 0.1253228 -0.0001678 0.063295 -0.0243165 -0.0016048 0.0911057 -0.0128676 -0.020766 0.0000346 0.1112509 0.0581498 -0.0855314 0.0830536 -0.0296082 0.035385 0.0441514 0.0778466 0.1070013 0.0380769 0.1051823 0.015125 -0.0276908 0.0141396 0.0171261 -0.0244525 -0.0367287 -0.079748 -0.0833209 0.4618515 0.0186271 -0.107497 -0.1108966 0.1998064 -0.0096857 -0.0347219 -0.0448685 0.2491974 -0.0660966 -0.1273494 0.0141846 -0.1406926 0.0286003 0.0557568 0.0617061 0.0621079 0.0146855 0.0992459 0.0022358 -0.0177883 0.1421335 0.0073942 0.053853 -0.0047743 -0.0087529 0.1206803 0.0148538 -0.0006164 0.0491 -0.0168533 0.0653851 -0.1049044 -0.03518 -0.1198675 -0.1006905 unknown
polarizability: 130.2755148|0.1783366|159.4782893|-15.6509394|-4.5786018|77.698633 unknown
InChI: InChI=1S/C7H10N4O3/c1-5-3-9-7(11(13)14)10(5)4-6(12)8-2/h3,8H,4H2,1-2H3
charge 0 multiplicity 1
24 atoms
O  2.742045 -1.783005 -0.320051
O  -1.673419 2.788113 -0.146156
O  0.349415 2.151113 -0.998496
N  -0.335623 -0.588333 -0.521336
N  -2.115405 0.151182 0.716355
N  2.629736 0.555725 -0.194529
N  -0.805839 1.885808 -0.418918
C  0.853796 -0.643387 -1.402238
C  -0.931222 -1.716009 0.050911
C  -1.087668 0.519087 -0.080736
C  -2.022168 -1.223668 0.805618
C  2.174593 -0.67714 -0.585355
C  -0.440858 -3.114554 -0.163257
C  3.849163 0.731908 0.603136
H  0.809484 -1.579727 -1.978242
H  0.825713 0.216888 -2.085248
H  -2.724532 -1.799856 1.403685
H  0.645872 -3.198215 0.01531
H  -0.967149 -3.795326 0.524652
H  -0.638906 -3.465018 -1.195193
H  2.049243 1.370305 -0.440394
H  4.57781 1.367896 0.069096
H  4.294969 -0.260458 0.774574
H  3.619246 1.19707 1.579013
