program: Gaussian 09
title: 000211785
version: EM64L-G09RevD.01
frameworkgroup: C1[X(C7H9N3O4)]
method: RPBEPBE
basis: SDD
operation: Freq
keyword: #pfreq=noraman
keyword: PBEPBE/SDD
title: #p freq=noraman PBEPBE/SDD
converged: YES YES NO NO
title: Mulliken charges:
elementType: O O O O N N N C C C C C C C H H H H H H H H H
charge: -0.404619 -0.207962 -0.164535 -0.242565 -0.212081 -0.002067 0.077891 0.487315 -0.517481 -0.491462 0.144923 -0.436515 -0.653246 0.224617 0.228727 0.244972 0.313700 0.260902 0.275351 0.235675 0.233334 0.212681 0.392447
chargesum: 0.00000
title: Mulliken charges with hydrogens summed into heavy atoms:
elementType: O O O O N N N C C C C C C C
charge: -0.012173 -0.207962 -0.164535 -0.242565 -0.212081 -0.002067 0.077891 0.487315 -0.043782 0.083139 0.144923 -0.161163 0.028444 0.224617
polarizability: 1.47383187e+02 3.40283584e+00 1.21449460e+02 8.79176272e+00 -1.28138746e+01 7.73700420e+01
1716.lowfreq: -7.4024 -3.3959 -0.0007 0.0005 0.0007 8.9771 31.8873 37.9976 66.0490
frequency: 31.7774 37.9913 66.0160 74.3858 88.3524 106.8251 175.7063 199.4334 236.1535 288.8467 305.8907 346.4160 367.0149 402.5317 444.1475 481.7662 542.5515 572.4097 624.8513 626.7784 654.1966 688.8194 701.9050 754.1768 773.9950 792.3582 847.9787 858.7883 901.5093 959.9334 1014.9441 1052.9327 1055.8842 1060.4218 1144.3258 1156.8633 1211.8651 1233.2609 1263.5922 1271.1186 1289.4070 1315.8319 1346.8507 1360.2342 1362.3538 1387.0552 1396.8695 1416.6491 1447.4554 1474.0954 1478.9193 1486.8190 1521.6955 1686.6240 2988.3219 2993.8975 3048.8538 3054.7211 3085.7339 3096.8108 3120.8512 3231.5234 3528.1042
redmass: 7.9871 7.7352 5.0893 9.7576 2.7795 7.9917 1.9060 2.1581 2.7454 6.7522 3.7486 3.0144 6.9224 3.9099 5.4878 1.9137 4.5737 4.5902 1.4811 8.9031 4.5172 4.1476 8.2866 7.4382 1.8707 2.3893 1.4218 4.0505 3.4753 2.3079 2.6456 1.6600 2.4791 1.8572 4.5404 2.7892 1.8746 1.5518 1.7388 2.0248 2.0161 1.6112 2.9415 11.0536 1.7617 2.8931 1.6744 2.7988 1.3675 1.0459 1.0699 1.1278 4.8986 9.1277 1.0355 1.0647 1.0623 1.0964 1.0996 1.1012 1.0997 1.0990 1.0644
irintensity: 0.4761 1.7801 0.0048 0.9357 0.2692 0.2102 0.2214 0.0334 1.0275 0.5130 3.1221 1.5350 0.5032 3.1257 7.0972 20.9786 1.6162 35.3788 129.6516 18.3807 6.2263 4.1335 2.5666 28.8226 17.1571 4.2197 25.7842 3.2584 5.1516 6.8701 7.7360 11.3163 302.2728 23.9230 182.0800 3.4026 3.3384 70.2373 17.9610 11.4488 29.1449 16.4986 43.8562 247.9171 69.2054 46.8327 21.0879 16.6787 37.9445 11.3957 6.3503 9.8982 37.8215 185.1545 26.4953 21.1660 10.9764 3.1123 46.9453 28.3651 0.7636 3.6947 46.2430
temp: 298.150 k
press: 1.00000 atm
elementType: 8 8 8 8 7 7 7 6 6 6 6 6 6 6 1 1 1 1 1 1 1 1 1
symmnumber: 1
zpe: 439857.3 jmol-1
zpe.correction: 0.167533 hartree
zpe.thermalcorrener: 0.181031 hartree
zpe.thermalcorrenthalpy: 0.181975 hartree
zpe.thermalcorrgfe: 0.125548 hartree
zpe.sumelectzpe: -736.148644 hartree
zpe.sumelectthermal: -736.135145 hartree
zpe.sumelectthermalent: -736.134201 hartree
zpe.sumelectthermalfe: -736.190629 hartree
dipole: 6.6071 4.6426 -1.0253
dipole: 8.1400
quadrupole: -80.0529 -82.2186 -84.4021
quadrupole: -9.8946 -0.8222 1.2340
quadrupole: 2.1716 0.0059 -2.1775 -9.8946 -0.8222 1.2340
hfenergy: -736.3161766 hartree
pointgroup: C01 [X(C7H9N3O4)]
dipole: 3.0742846 0.6212123 -0.6472679 debye
dipolederiv: -0.3838694 -0.0436762 -0.0240356 -0.0732124 -1.2208875 0.4416921 -0.0323968 0.3071652 -0.4263491 -0.2857955 -0.0310135 0.1177784 0.0136069 -0.6543165 -0.0440801 0.0727754 0.1200195 -0.8674898 -0.9914746 -0.1560602 0.020852 -0.2293005 -0.4099602 0.0657375 0.0617929 0.0886646 -0.2162487 -0.5445251 -0.021501 -0.0260977 0.1631228 -0.8342587 0.2154225 -0.1091609 0.2536724 -0.3415219 0.1666809 -0.1314341 0.0624795 -0.0801827 -0.6005091 0.1928177 0.1014315 0.2327208 -0.1830409 0.0951337 -0.1192436 0.0794275 -0.4205307 -0.3027329 -0.008174 0.2081566 0.042182 -0.1868125 1.9318224 -0.10858 0.1175292 -0.2379429 1.1062943 -0.3535459 0.1856393 -0.4217179 0.3322745 0.3263045 -0.1762114 0.0207822 0.5588737 0.1284463 -0.0548341 -0.29071 -0.0667487 -0.0105552 0.0199136 0.0225033 0.0098686 -0.0091625 0.1269552 0.0133299 0.1833237 -0.0128278 0.0637215 0.1982225 0.1365109 0.0450534 0.0836842 0.2676849 -0.1114129 0.0233473 -0.2642682 0.0188817 -0.6869143 0.4843078 -0.1729742 0.6431967 0.1799636 0.0212926 -0.3366603 0.0217459 0.1038606 -0.5364943 0.0882939 -0.0534059 -0.3762664 0.1387531 -0.1633084 0.1591203 -0.1526914 -0.0742911 -0.0270227 0.0047564 0.0266598 -0.0603589 0.0743452 -0.0170487 -0.0851055 -0.0075956 0.0144467 0.2562738 -0.0178908 -0.1769982 -0.0282091 1.6271723 -0.2061434 -0.1241615 -0.1531047 1.1628047 -0.0016719 -0.0115909 0.0197618 -0.0713942 -0.1125993 -0.0855376 0.017507 -0.0495155 0.0484974 0.0300004 0.0246698 -0.0206881 0.068685 0.024876 0.1020649 -0.0469612 0.070399 -0.0218326 0.1001347 0.0313116 -0.0702994 -0.0174567 0.0463181 0.0013987 -0.0156219 -0.0017536 0.068103 -0.0464801 -0.0701881 0.0548035 -0.0155581 0.0491652 -0.0142503 0.0022606 -0.0050058 0.1115035 0.0640413 0.0437229 -0.0304857 0.0605808 0.0548303 0.0575665 -0.034543 0.06222 0.1461455 0.1102695 -0.0601502 -0.0041189 -0.0075336 -0.1096859 -0.0793666 -0.0019031 -0.0269093 0.0555354 -0.2134288 -0.0191297 0.035631 -0.0405905 0.0986576 -0.006075 0.0524711 -0.0160086 0.0676904 0.0542544 0.0777012 -0.0826638 0.057929 -0.0061613 0.1103025 -0.0511171 0.0801032 -0.0342198 0.3646251 0.0528919 0.0511405 0.0180202 0.3276492 -0.077848 0.0605156 -0.1007455 0.1688968 unknown
polarizability: 145.937327|-8.0990709|121.1284603|-1.0704828|-17.2930591|79.1369016 unknown
InChI: InChI=1S/C7H9N3O4/c1-2-5-3-8-7(10(13)14)9(5)4-6(11)12/h3,11H,2,4H2,1H3
charge 0 multiplicity 1
23 atoms
O  0.234345 3.447671 -0.434574
O  -0.032583 2.098478 1.447379
O  -3.294516 -0.916582 0.010044
O  -2.217741 0.949175 -0.767618
N  0.285535 -0.217483 -0.189725
N  -0.798948 -2.037724 0.668798
N  -2.228308 -0.247773 -0.237174
C  1.272177 -1.091269 0.288782
C  2.751396 -0.840363 0.197384
C  0.537228 1.109233 -0.759987
C  -0.948316 -0.837367 0.079425
C  0.569995 -2.200957 0.80279
C  3.349042 -1.133953 -1.207723
C  0.198114 2.225695 0.231742
H  2.99157 0.197817 0.49931
H  3.243148 -1.49372 0.939729
H  -0.057817 1.265893 -1.670754
H  1.604675 1.191128 -1.025208
H  0.988199 -3.093959 1.261795
H  3.16614 -2.183032 -1.49778
H  4.439581 -0.960414 -1.203261
H  2.905761 -0.489483 -1.988734
H  0.003222 4.184991 0.192259
