program: Gaussian 09
title: 000211782
version: EM64L-G09RevD.01
frameworkgroup: C1[X(C8H13N3O3)]
method: RPBEPBE
basis: SDD
operation: Freq
keyword: #p
keyword: freq=noraman
keyword: PBEPBE/SDD
title: #p freq=noraman PBEPBE/SDD
converged: YES YES NO NO
title: Mulliken charges:
elementType: O O O N N N C C C C C C C C H H H H H H H H H H H H H
charge: -0.431818 -0.168426 -0.255291 -0.221758 -0.008099 0.071999 -0.185240 0.476894 -0.399347 0.107444 -0.680182 -0.671272 -0.447288 -0.318837 0.218949 0.228318 0.262333 0.218328 0.222239 0.230048 0.222808 0.224202 0.222405 0.275625 0.235669 0.217226 0.353071
chargesum: 0.00000
title: Mulliken charges with hydrogens summed into heavy atoms:
elementType: O O O N N N C C C C C C C C
charge: -0.078746 -0.168426 -0.255291 -0.221758 -0.008099 0.071999 0.033709 0.476894 0.091303 0.107444 -0.009567 -0.001857 -0.171663 0.134058
polarizability: 1.71183379e+02 4.74604913e-01 1.30596586e+02 2.60324815e+00 -6.28989313e+00 7.80997989e+01
1716.lowfreq: -5.4542 -0.0008 -0.0006 0.0007 7.5246 10.4063 20.3302 44.2477 53.3492
frequency: 17.6211 44.2144 53.3323 64.1589 101.2328 138.2390 160.7086 188.1241 224.0105 246.2067 266.9193 289.9087 308.9332 321.9602 329.2290 377.1787 406.9513 428.0804 487.6067 584.0614 621.5932 632.4851 690.4795 702.4692 741.1567 770.5003 791.1142 849.0997 875.1170 920.8744 931.5191 957.9342 979.6824 1037.2661 1055.8797 1065.5533 1109.2939 1125.3201 1142.6564 1153.8130 1187.4437 1232.7561 1263.4420 1288.7748 1299.1592 1308.1115 1319.2123 1347.0656 1353.1046 1358.3379 1380.2843 1383.1002 1385.2218 1402.2388 1422.8746 1465.9387 1468.0170 1469.2146 1476.0900 1481.7668 1482.2556 1508.3301 2983.3678 2986.4768 3003.4472 3006.0322 3049.5510 3080.5042 3082.4130 3083.9966 3088.7697 3091.2228 3118.0151 3231.1836 3573.4397
redmass: 2.8880 7.7365 5.6852 4.8382 2.4945 4.1113 4.0317 4.1430 1.1031 1.9731 1.4243 3.1968 3.7723 5.0596 1.2483 3.2844 3.4435 4.3668 5.9469 4.1638 6.2074 3.9381 5.9142 5.1986 7.6349 6.2866 1.2251 1.4554 3.0715 1.1653 2.9094 1.4753 4.3873 4.3730 1.6562 1.4291 2.5755 5.0397 1.6801 2.8008 2.1478 2.6619 1.7016 1.3974 1.8096 2.7206 1.2597 2.2818 7.8262 1.3309 3.3334 1.3021 1.3994 1.2661 2.5486 1.0734 1.1067 1.0612 1.1175 1.1655 1.1037 2.6761 1.0347 1.0354 1.0830 1.0608 1.0599 1.1037 1.1007 1.1007 1.1001 1.1001 1.1055 1.0982 1.0666
irintensity: 0.1359 1.6147 4.9831 0.3373 2.0300 4.3702 1.3002 0.3295 0.0759 0.5455 0.0822 7.5809 0.5174 34.6749 132.7463 4.0880 0.7519 2.3131 0.4151 2.9008 5.6906 5.9601 0.8354 4.7469 20.3775 11.0359 4.0695 23.8229 5.9617 3.0726 35.1380 0.8962 113.3557 17.3444 5.8841 60.3060 1.3162 81.6929 15.3658 97.0800 6.8893 78.7611 42.4038 5.1301 38.3775 8.3632 32.3250 69.0006 257.8424 35.4038 22.6465 17.3403 5.7518 13.1756 11.0131 2.2387 9.3185 5.0023 7.6039 1.3804 31.6191 37.3737 25.3246 25.9929 9.0295 24.9308 24.8450 17.1707 0.9328 24.8705 60.6833 37.0408 8.2085 4.7863 16.2975
temp: 298.150 k
press: 1.00000 atm
elementType: 8 8 8 7 7 7 6 6 6 6 6 6 6 6 1 1 1 1 1 1 1 1 1 1 1 1 1
symmnumber: 1
zpe: 561369.5 jmol-1
zpe.correction: 0.213814 hartree
zpe.thermalcorrener: 0.228513 hartree
zpe.thermalcorrenthalpy: 0.229457 hartree
zpe.thermalcorrgfe: 0.170374 hartree
zpe.sumelectzpe: -701.383499 hartree
zpe.sumelectthermal: -701.368800 hartree
zpe.sumelectthermalent: -701.367856 hartree
zpe.sumelectthermalfe: -701.426940 hartree
dipole: 5.7205 2.4310 -0.9287
dipole: 6.2846
quadrupole: -88.1625 -97.4123 -81.0868
quadrupole: -12.9636 1.3898 -0.5376
quadrupole: 0.7247 -8.5251 7.8004 -12.9636 1.3898 -0.5376
hfenergy: -701.5973135 hartree
pointgroup: C01 [X(C8H13N3O3)]
dipole: -2.290663 0.8399979 0.4009591 debye
polarizability: 171.1724275|1.8039662|130.7866391|0.453402|5.8406417|77.9206972 unknown
InChI: InChI=1S/C8H13N3O3/c1-6(2)7-5-9-8(11(13)14)10(7)3-4-12/h5-6,12H,3-4H2,1-2H3
charge 0 multiplicity 1
27 atoms
O  0.473827 3.791644 -0.037157
O  3.277344 -1.658173 -0.060525
O  2.858204 0.587479 0.092638
N  0.060857 0.040908 0.264003
N  0.52189 -2.116913 -0.353301
N  2.470149 -0.66118 0.006801
C  -2.52876 0.037209 0.252417
C  -1.170267 -0.607829 0.090892
C  0.238623 1.449202 0.688214
C  1.049852 -0.919554 -0.025201
C  -3.422647 -0.786705 1.217538
C  -3.217909 0.208256 -1.132558
C  -0.84621 -1.932049 -0.286132
C  0.335302 2.415661 -0.516869
H  -2.403783 1.04749 0.687492
H  -0.614407 1.738804 1.323535
H  1.159813 1.519954 1.285818
H  -3.605146 -1.801546 0.82044
H  -4.402425 -0.291546 1.34247
H  -2.955511 -0.889615 2.212757
H  -2.59991 0.81042 -1.822418
H  -4.193357 0.712965 -1.011402
H  -3.395219 -0.774417 -1.605429
H  -1.530305 -2.746399 -0.512644
H  1.178232 2.115676 -1.168272
H  -0.600395 2.406416 -1.101188
H  1.409957 3.94854 0.244381
