program: Gaussian 09
title: 000211769
version: EM64L-G09RevD.01
frameworkgroup: C1[X(C15H17N3O3)]
method: RPBEPBE
basis: SDD
operation: Freq
keyword: #p
keyword: freq=noraman
keyword: PBEPBE/SDD
title: #p freq=noraman PBEPBE/SDD
converged: YES YES NO NO
title: Mulliken charges:
elementType: O O O N N N C C C C C C C C C C C C C C C H H H H H H H H H H H H H H H H H
charge: -0.297236 -0.283593 -0.298985 -0.121145 -0.664636 -0.002018 0.028073 0.318789 0.312713 0.280506 -0.576223 -0.584181 0.124901 0.276940 -0.296075 -0.438410 -0.517322 -0.533813 -0.526403 -0.195028 -0.330826 0.265636 0.289148 0.238689 0.283719 0.255562 0.215483 0.226471 0.231262 0.222075 0.242250 0.213607 0.267301 0.223994 0.231941 0.356914 0.316156 0.243764
chargesum: 0.00000
title: Mulliken charges with hydrogens summed into heavy atoms:
elementType: O O O N N N C C C C C C C C C C C C C C C
charge: -0.297236 -0.283593 -0.298985 -0.121145 0.008434 -0.002018 0.028073 0.318789 0.312713 0.280506 -0.310587 -0.295033 0.124901 0.276940 -0.057386 -0.154692 0.180194 0.161774 0.178499 0.036913 -0.087062
polarizability: 3.59678343e+02 -6.57386239e+00 2.03638121e+02 -5.16424605e-01 -1.21068369e+01 1.10833244e+02
1716.lowfreq: -5.3977 -0.9513 -0.0005 0.0006 0.0007 5.9506 27.8517 33.2579 45.2633
frequency: 27.8425 33.2186 45.2572 67.8057 78.3792 82.6743 88.3197 106.1464 133.0628 155.7933 167.5075 176.3416 183.3562 199.1598 213.7464 230.1651 273.3709 278.5175 294.8059 311.3973 331.1990 373.0415 398.2679 417.2151 423.7769 444.6437 465.4870 499.0890 506.7253 560.4399 569.8209 599.5114 610.2907 619.6124 635.0147 688.6416 696.9626 719.4398 727.0685 754.2214 782.9420 819.0706 841.5553 865.9956 875.7252 913.9702 929.0828 950.9657 956.2116 984.5688 989.9596 1001.3103 1024.9258 1054.2907 1065.9846 1108.7828 1111.9047 1112.9787 1114.7604 1126.5120 1143.5427 1153.0799 1160.1010 1165.2505 1195.7463 1203.1212 1212.5210 1303.4387 1312.0801 1322.7925 1347.3509 1358.7266 1405.7492 1412.4567 1417.8081 1433.6470 1443.2317 1453.3028 1457.0929 1458.7105 1466.3480 1467.5237 1479.9137 1481.5462 1486.9646 1549.1911 1558.9900 1581.0015 1589.3625 1600.2443 1637.1308 2964.9052 2972.5376 2975.3612 3055.1857 3079.3427 3080.3038 3120.9975 3123.9922 3124.8187 3128.7351 3136.6950 3153.1579 3161.1822 3167.9129 3176.3669 3514.7993 3664.0863
redmass: 4.7529 4.6396 4.6953 3.3410 3.8599 2.8431 3.2552 3.3358 3.9523 1.2684 1.5021 2.7066 3.2315 3.1293 1.8166 5.0005 5.7197 1.8672 3.8856 5.1415 3.9043 3.7928 3.2640 2.4755 6.3032 2.9339 2.0387 4.6531 6.1041 1.8950 2.4787 5.2462 3.8352 5.6581 4.7074 6.5838 4.1812 1.8983 6.0347 4.2171 4.5460 1.7259 1.6503 3.6260 1.8068 5.9845 1.3531 8.8476 1.4894 1.4347 5.2673 3.4535 3.8497 1.9503 6.5687 1.2391 1.2410 1.2585 1.7644 1.9538 2.0621 1.3973 1.4530 1.8774 1.7731 1.5264 1.4941 5.4928 7.3542 1.3441 4.8279 3.9269 2.4483 2.1638 1.3355 1.3063 1.3138 1.3095 1.1524 1.7612 1.0499 1.6935 1.3706 1.0546 1.0602 5.6217 7.6421 5.9035 3.8553 2.9453 1.8978 1.0325 1.0335 1.0320 1.1040 1.0993 1.1007 1.1039 1.1046 1.1003 1.0875 1.0915 1.0914 1.0926 1.0995 1.0907 1.0460 1.1024
irintensity: 4.0653 0.6264 0.3447 2.8830 7.8061 5.9613 7.9948 1.2842 3.0354 0.0566 2.1777 1.0399 5.4150 6.2628 1.0404 1.5384 4.2562 1.9935 6.5495 5.9274 15.1297 6.1572 3.5802 35.6041 2.9737 19.5645 80.6485 5.8290 3.2820 51.4651 47.4041 3.7217 5.6067 8.0898 7.0727 12.2265 2.2631 40.1474 15.5377 20.6736 2.9147 33.8948 28.2113 1.6173 35.9648 25.9155 1.4542 66.2647 7.2492 1.4394 51.3766 36.1250 5.7909 7.8287 263.6543 14.7153 4.7423 0.1490 5.3967 12.1288 1.8346 3.8034 25.1158 19.3757 119.9451 37.8948 38.3185 49.0603 33.2830 5.7654 63.5708 67.3656 43.2913 12.3178 22.0484 7.2490 6.9662 44.2309 12.1581 9.1148 13.5420 180.5537 55.0704 14.7694 31.2087 52.3828 161.2331 49.0825 216.7199 30.6545 296.3996 59.1571 102.0475 85.2193 41.7187 34.7775 31.5749 22.9809 19.4333 26.5843 2.3964 22.7053 1.3804 14.6488 21.4717 2.5700 17.7067 34.1211
temp: 298.150 k
press: 1.00000 atm
elementType: 8 8 8 7 7 7 6 6 6 6 6 6 6 6 6 6 6 6 6 6 6 1 1 1 1 1 1 1 1 1 1 1 1 1 1 1 1 1
symmnumber: 1
zpe: 781623.1 jmol-1
zpe.correction: 0.297705 hartree
zpe.thermalcorrener: 0.318621 hartree
zpe.thermalcorrenthalpy: 0.319565 hartree
zpe.thermalcorrgfe: 0.246947 hartree
zpe.sumelectzpe: -970.119751 hartree
zpe.sumelectthermal: -970.098835 hartree
zpe.sumelectthermalent: -970.097891 hartree
zpe.sumelectthermalfe: -970.170508 hartree
dipole: -0.0084 -1.2851 3.2139
dipole: 3.4613
quadrupole: -112.1141 -111.5242 -121.1647
quadrupole: -20.1094 6.1555 0.8044
quadrupole: 2.8202 3.4101 -6.2304 -20.1094 6.1555 0.8044
hfenergy: -970.4174556 hartree
pointgroup: C01 [X(C15H17N3O3)]
dipole: -0.0631437 -0.3052391 -1.3256396 debye
polarizability: 359.2722192|6.5412615|197.6748391|-11.0231839|25.3395976|117.2026498 unknown
InChI: InChI=1S/C15H17N3O3/c1-19-12-7-11(8-13(20-2)14(12)21-3)18-15(16)10-5-4-6-17-9-10/h4-9H,16H2,1-3H3
charge 0 multiplicity 1
38 atoms
O  4.498266 -0.264024 -0.460113
O  3.343956 2.241169 -0.038784
O  2.807228 -2.570349 -0.618519
N  -1.136202 0.251848 0.118349
N  -1.825079 -1.19173 -1.694767
N  -5.127412 1.355047 0.842506
C  3.101075 -0.122012 -0.346246
C  0.256038 0.077447 -0.07815
C  2.471735 1.141673 -0.117828
C  2.283853 -1.284002 -0.381438
C  1.072108 1.239006 0.014755
C  0.878887 -1.188472 -0.256204
C  -2.059082 -0.356233 -0.602587
C  -3.4916 -0.119704 -0.248282
C  -4.531663 -1.016295 -0.605825
C  -3.850702 1.04829 0.480761
C  5.127511 0.442436 -1.597547
C  2.755621 3.546308 0.275603
C  3.853453 -3.043503 0.315494
C  -5.861141 -0.712636 -0.238675
C  -6.11364 0.478011 0.478152
H  0.576008 2.193604 0.204852
H  0.305931 -2.120946 -0.235398
H  -4.311207 -1.956623 -1.124159
H  -3.063984 1.746429 0.781436
H  4.999457 1.532786 -1.492306
H  4.692966 0.093731 -2.553879
H  6.194007 0.173623 -1.548717
H  2.23706 3.524011 1.252873
H  2.048612 3.871058 -0.512207
H  3.607697 4.240455 0.321302
H  3.436779 -3.130572 1.337815
H  4.717972 -2.359899 0.313444
H  4.140257 -4.038882 -0.057241
H  -6.683933 -1.388838 -0.490812
H  -0.864955 -1.378454 -1.984589
H  -2.576257 -1.42173 -2.340734
H  -7.130625 0.748672 0.783867
