program: Gaussian 09
title: 000211765
version: EM64L-G09RevD.01
frameworkgroup: C1[X(C13H11ClN2)]
method: RPBEPBE
basis: SDD
operation: Freq
keyword: #p
keyword: freq=noraman
keyword: PBEPBE/SDD
title: #p freq=noraman PBEPBE/SDD
converged: YES YES NO NO
title: Mulliken charges:
elementType: Cl N N C C C C C C C C C C C C C H H H H H H H H H H H
charge: -0.080588 -0.165901 -0.646308 0.375336 0.141170 -0.263131 -0.335165 0.248920 -0.229205 -0.238174 -0.219236 -0.386217 -0.408464 -0.204195 -0.210618 -0.259428 0.299477 0.258127 0.237450 0.249184 0.261113 0.239175 0.224040 0.222807 0.226673 0.345640 0.317518
chargesum: 0.00000
title: Mulliken charges with hydrogens summed into heavy atoms:
elementType: Cl N N C C C C C C C C C C C C C
charge: -0.080588 -0.165901 0.016850 0.375336 0.141170 -0.263131 -0.035689 0.248920 0.028922 -0.000723 0.019940 -0.137034 -0.147351 0.019845 0.012189 -0.032755
polarizability: 2.73257111e+02 8.35201495e+00 1.48550342e+02 2.73394312e+00 -7.84432946e+00 1.00537905e+02
1716.lowfreq: 0.0009 0.0013 0.0016 4.0873 5.8054 6.5245 21.3262 45.4580 55.2422
frequency: 21.2912 45.4310 55.2273 78.2919 123.5518 187.1667 193.3245 225.6842 286.4748 339.5031 369.1185 393.0412 405.8536 441.0974 466.6099 475.2287 513.0990 534.5053 555.6192 565.8977 612.3593 630.8449 668.2744 671.6588 699.0878 729.6797 749.4126 771.6319 790.8685 805.1056 842.4333 879.0252 905.2095 967.0405 967.5428 981.8936 984.2673 1001.3707 1003.4384 1019.8147 1035.7089 1069.0237 1074.9912 1107.7627 1144.3231 1167.4320 1170.7590 1177.8920 1244.9589 1261.2990 1303.6130 1359.0132 1367.3434 1374.6699 1421.3156 1436.4066 1461.8833 1472.7300 1561.7102 1572.1245 1586.0416 1605.8873 1609.1053 1637.5258 3118.9396 3128.0857 3140.4180 3140.5683 3153.7858 3154.1639 3165.9587 3166.4823 3177.9551 3503.1270 3645.9659
redmass: 4.9835 4.6585 5.6051 5.1141 4.6390 5.1965 7.1269 5.8273 6.5391 5.1941 6.3077 4.5792 2.9684 3.1509 4.1182 1.8545 3.1092 1.8327 2.2496 2.0109 6.2667 5.6760 4.8417 5.4500 1.9379 3.6813 2.2312 1.3660 2.9857 5.2749 1.2464 1.3711 1.4467 1.3582 1.3619 4.6798 1.3743 5.6274 1.4306 2.2663 2.6134 1.8606 1.5826 1.9789 1.7718 1.0560 1.0626 1.1159 2.1188 1.9201 1.4421 5.0974 5.6582 3.4914 2.5399 2.4679 2.5839 2.4511 6.1980 5.9429 4.1248 6.3968 5.3571 1.4388 1.0848 1.0872 1.0861 1.0936 1.0952 1.0904 1.0953 1.1007 1.0999 1.0449 1.1046
irintensity: 1.5077 0.3624 2.7141 1.8708 0.1112 3.7077 1.1300 1.5974 4.2204 9.7511 2.1287 4.2932 2.8419 4.9281 6.2154 36.0849 5.9967 85.7311 63.2097 53.2315 3.3543 5.2322 15.8601 22.6027 42.9958 10.3896 33.0801 71.1999 42.4073 22.1801 1.6880 1.1979 4.8693 3.5159 0.1126 1.1343 0.1498 41.4813 7.9913 17.0655 10.1287 57.0143 12.8633 2.8016 4.4764 0.4241 6.5125 1.5563 2.2450 32.1253 2.4295 60.2508 1.4899 54.6644 63.2712 5.9081 6.6535 46.1342 32.4526 8.5374 378.3017 28.5833 26.8304 239.8361 7.5058 3.3596 4.4671 23.1261 30.7510 4.8536 10.4103 21.5832 17.8731 55.7868 127.0470
temp: 298.150 k
press: 1.00000 atm
elementType: 17 7 7 6 6 6 6 6 6 6 6 6 6 6 6 6 1 1 1 1 1 1 1 1 1 1 1
symmnumber: 1
zpe: 542362.6 jmol-1
zpe.correction: 0.206575 hartree
zpe.thermalcorrener: 0.220276 hartree
zpe.thermalcorrenthalpy: 0.221220 hartree
zpe.thermalcorrgfe: 0.164205 hartree
zpe.sumelectzpe: -1070.432274 hartree
zpe.sumelectthermal: -1070.418574 hartree
zpe.sumelectthermalent: -1070.417629 hartree
zpe.sumelectthermalfe: -1070.474645 hartree
dipole: -1.4157 0.6352 -0.6982
dipole: 1.7015
quadrupole: -86.3425 -95.1911 -100.4353
quadrupole: 8.4835 1.0369 -2.4472
quadrupole: 7.6471 -1.2015 -6.4457 8.4835 1.0369 -2.4472
hfenergy: -1070.6388495 hartree
pointgroup: C01 [X(C13H11Cl1N2)]
dipole: -0.5199646 -0.0875893 -0.4124009 debye
polarizability: 273.0995977|-5.3287586|104.1228257|8.0903259|-14.9788883|145.122935 unknown
InChI: InChI=1S/C13H11ClN2/c14-12-9-5-4-8-11(12)13(15)16-10-6-2-1-3-7-10/h1-9H,15H2
charge 0 multiplicity 1
27 atoms
Cl -2.690736 1.598457 -2.485569
N  0.543702 -0.171311 0.409356
N  0.116812 0.523305 -1.837941
C  -1.761251 -0.020022 -0.279648
C  -0.287142 0.121018 -0.576265
C  -2.865175 0.511783 -0.996272
C  -2.087546 -0.798398 0.871349
C  1.95203 -0.199125 0.254165
C  -4.204527 0.286673 -0.615123
C  -3.412764 -1.038332 1.271393
C  -4.483708 -0.497423 0.522569
C  2.754497 0.544091 1.166603
C  2.604743 -1.023266 -0.71361
C  4.161672 0.483821 1.098735
C  4.014475 -1.089745 -0.762359
C  4.80285 -0.33139 0.134504
H  -1.234763 -1.189335 1.434733
H  -5.013936 0.726747 -1.204171
H  -3.610616 -1.6444 2.161258
H  2.250853 1.155745 1.922227
H  2.00186 -1.638516 -1.392161
H  -5.523451 -0.675076 0.816144
H  4.761058 1.067868 1.806718
H  4.497725 -1.740553 -1.5007
H  5.896115 -0.383155 0.091082
H  1.114907 0.632724 -2.017189
H  -0.550884 0.824519 -2.544932
