program: Gaussian 09
title: 000215375
version: EM64L-G09RevD.01
frameworkgroup: C1[X(C10H8N4O4)]
method: RPBEPBE
basis: SDD
operation: Freq
keyword: #p
keyword: freq=noraman
keyword: PBEPBE/SDD
title: #p freq=noraman PBEPBE/SDD
converged: NO YES NO NO
title: Mulliken charges:
elementType: O O O O N N N N C C C C C C C C C C H H H H H H H H
charge: -0.269158 -0.203711 -0.218527 -0.212096 -0.498481 -0.447266 0.020700 -0.061737 0.508052 -0.422997 -0.299262 0.392594 -0.345739 -0.363790 0.282146 0.259696 -0.140228 -0.268941 0.228022 0.315923 0.300104 0.288355 0.288528 0.328170 0.270933 0.268709
chargesum: 0.00000
title: Mulliken charges with hydrogens summed into heavy atoms:
elementType: O O O O N N N N C C C C C C C C C C
charge: -0.269158 -0.203711 -0.218527 -0.212096 -0.198378 -0.119095 0.020700 -0.061737 0.508052 -0.194975 0.016661 0.392594 -0.057385 -0.075262 0.282146 0.259696 0.130705 -0.000232
polarizability: 3.31085806e+02 -1.99028551e+00 1.48706019e+02 4.43447254e-03 1.29277750e-02 5.82454339e+01
1716.lowfreq: -23.4552 -4.3606 -0.0004 0.0003 0.0009 1.0264 8.4100 27.8086 55.5612
frequency: -23.1955 27.7980 55.5559 59.4731 68.8740 79.6738 134.5039 154.9163 200.2151 240.1561 276.8974 297.0883 336.4669 361.0613 408.1545 416.1510 454.6678 509.1344 516.4505 581.1780 612.9992 621.3998 624.9785 666.6856 668.4238 701.0022 722.1724 724.4472 736.2140 761.1827 786.2134 831.6689 835.1658 850.3755 878.3128 882.3414 911.3045 977.0195 983.2270 999.0242 1001.8316 1009.7395 1069.2260 1096.5484 1108.9226 1121.7806 1162.7377 1182.8125 1188.8210 1224.7466 1273.6784 1283.0643 1302.9833 1354.6198 1390.8295 1428.9186 1487.4862 1491.7020 1507.3640 1522.5562 1601.4847 1607.6400 1617.0106 1678.7574 3124.7860 3179.8727 3186.4615 3203.2338 3250.2147 3295.0992 3517.0198 3542.1010
redmass: 6.1728 8.1497 9.5239 7.4596 5.8566 6.3240 4.8503 8.5342 10.2467 8.0484 3.4884 5.0098 9.3061 6.7074 9.1877 2.9816 1.7050 7.3839 2.5327 3.1499 8.2335 1.2326 7.4157 4.7310 5.8158 9.8764 1.3753 8.4577 4.7190 7.3607 8.8147 1.3865 6.2276 1.3498 1.4931 8.2229 5.9857 1.3420 7.0170 3.1488 7.3768 1.3181 2.5938 2.9589 1.3530 1.3036 3.0402 1.7885 2.5639 4.0727 2.1443 1.5550 1.4666 7.1429 5.8806 4.8391 2.6131 3.6381 2.1070 1.9434 5.8728 8.8546 6.6322 5.6193 1.0907 1.0907 1.0945 1.0960 1.0934 1.1094 1.0766 1.0763
irintensity: 0.0255 0.0493 6.7823 0.4402 0.8002 2.5048 0.0001 5.2491 0.1797 4.3018 9.1648 4.1914 1.1492 2.9276 8.4063 0.0163 0.5217 1.7269 34.5532 6.4681 0.0287 136.5739 1.7561 21.3582 35.7837 43.7454 46.3586 20.8947 7.5563 6.4776 25.7364 31.6796 4.7280 12.3871 72.0525 20.7044 15.3238 0.9662 11.7602 0.6346 9.5490 0.2443 49.6746 27.5644 94.4840 24.1221 766.9233 81.7062 2.9808 438.8866 66.1814 5.2085 63.9265 98.3805 290.3993 25.0820 193.9565 122.5646 886.7378 38.1176 40.1556 597.6223 7.1784 155.8576 14.5911 2.5354 3.1550 5.8388 8.2350 0.9456 3.2630 44.5497
temp: 298.150 k
press: 1.00000 atm
elementType: 8 8 8 8 7 7 7 7 6 6 6 6 6 6 6 6 6 6 1 1 1 1 1 1 1 1
symmnumber: 1
zpe: 472325.3 jmol-1
zpe.correction: 0.179899 hartree
zpe.thermalcorrener: 0.194357 hartree
zpe.thermalcorrenthalpy: 0.195301 hartree
zpe.thermalcorrgfe: 0.136429 hartree
zpe.sumelectzpe: -904.394267 hartree
zpe.sumelectthermal: -904.379809 hartree
zpe.sumelectthermalent: -904.378865 hartree
zpe.sumelectthermalfe: -904.437737 hartree
dipole: -7.3547 5.9049 0.0006
dipole: 9.4319
quadrupole: -124.4816 -97.7371 -105.2585
quadrupole: -3.4541 -0.0016 0.0013
quadrupole: -15.3226 11.4220 3.9006 -3.4541 -0.0016 0.0013
hfenergy: -904.5741661 hartree
pointgroup: C01 [X(C10H8N4O4)]
dipole: -2.8871064 2.3311984 0.000217 debye
dipolederiv: -0.5271798 -0.1138838 -0.0000229 0.2453844 -0.6957159 -0.0000485 0.0000077 -0.0000532 -0.1128482 -0.787177 0.0377656 -0.0000007 0.0144143 -0.7757985 -0.0000733 -0.0000054 -0.0000751 -0.3197557 -1.023823 -0.1808537 -0.0000379 -0.3858419 -0.5938005 -0.0000459 -0.0001325 -0.0000899 -0.2395339 -0.7802137 0.1979546 0.0000215 0.4642637 -0.7584063 -0.0001028 0.0000236 -0.0000435 -0.2343268 -2.8166197 -0.1387081 -0.0000528 -0.5495205 -0.3459901 -0.0000078 -0.0001035 -0.0000026 -0.3508795 -2.607468 -0.0274593 -0.0000306 0.269386 -0.3888906 0.0000013 0.0000189 -0.0000034 -0.3582012 2.4105009 -0.1290494 0.0000309 -0.2527695 1.1073333 0.0001493 0.000057 0.0001441 0.1926351 -0.5203667 -0.0968577 -0.0000211 -0.497845 -0.466483 -0.0000364 -0.0000612 -0.0000268 -0.2119739 2.0889937 -0.0883868 0.0000109 -0.5266414 0.140654 -0.0000026 -0.0000654 0.0000016 0.1292938 -0.7658166 -0.0267695 -0.0000132 -0.3555431 0.0888405 0.0000412 -0.0000556 0.0000454 -0.2035719 -0.6022823 0.1151686 0.0000117 0.5817981 -0.1225628 0.0000117 0.000089 0.0000056 -0.1505636 -1.2460319 0.1199125 -0.0000154 0.1943799 -0.0781603 -0.0000133 0.0000122 -0.0000189 0.0349669 0.423455 -0.0278707 0.0000022 -0.3398709 0.0532924 0.0000129 -0.0000275 0.000021 -0.0888999 0.5555008 -0.0857441 -0.0000048 0.1740596 0.0231084 0.0000251 0.0000583 0.0000131 -0.0931666 3.5209723 0.0436058 0.0000397 0.2122883 1.1821713 0.0001389 0.000078 0.0001368 0.3416665 1.8347958 0.2117575 0.0000622 0.6099807 0.6913228 0.0000469 0.000125 0.0000466 0.1849292 -0.1783565 0.1396762 0.0000137 -0.0361732 0.2479903 0.0000436 0.0000045 0.0000408 -0.1607876 0.224196 0.0566319 0.0000228 0.2335945 0.1250811 0.0000319 0.0000278 0.0000292 -0.1411017 0.0271434 0.1019979 0.0000127 0.0871635 -0.0623194 -0.0000344 0.000006 -0.0000348 0.1655172 0.1796233 -0.040609 -0.0000073 -0.0394531 0.0845606 -0.0000147 -0.0000139 -0.0000129 0.176711 0.1247393 -0.0050161 -0.0000027 -0.0021328 0.0931648 -0.0000346 -0.0000033 -0.000033 0.3175334 0.0834891 -0.0661375 -0.0000102 -0.0206801 0.074856 -0.000014 -0.0000046 -0.0000159 0.170762 0.1063984 0.0425718 0.0000072 0.0082662 0.0516557 -0.0000191 -0.0000003 -0.0000176 0.1668927 0.1600528 -0.0098125 -0.0000036 -0.0371121 0.1659885 -0.0000263 -0.0000207 -0.0000284 0.3455887 0.0697206 0.0122316 -0.0000038 0.0471728 0.0939409 -0.0000132 0.0000002 -0.0000148 0.2432112 0.0457539 -0.0421158 -0.0000085 -0.0985685 0.0641668 -0.0000158 -0.0000143 -0.0000135 0.1959029 unknown
polarizability: 331.0733614|-2.4961511|148.7184642|0.0044703|0.0129154|58.2454339 unknown
InChI: InChI=1S/C10H8N4O4/c15-9(13-10-11-5-6-18-10)12-7-1-3-8(4-2-7)14(16)17/h1-6,12-13H
charge 0 multiplicity 1
26 atoms
O  -4.986971 1.095805 -0.000038
O  -1.380389 -1.287319 -0.000294
O  6.035322 0.72816 0.000194
O  5.617962 -1.517311 -0.000188
N  -0.357625 0.845873 0.000048
N  -2.68349 0.678699 0.000004
N  5.22852 -0.284277 -0.000081
N  -4.388822 -1.132925 -0.000222
C  1.014598 0.501617 0.000007
C  1.950571 1.577457 0.000186
C  1.485173 -0.842961 -0.000198
C  3.777174 -0.013265 -0.000045
C  3.329642 1.32705 0.000165
C  2.867927 -1.093429 -0.000222
C  -1.459975 -0.037848 -0.000096
C  -3.953757 0.114146 -0.000095
C  -6.178111 0.315241 -0.000142
C  -5.807036 -1.011052 -0.000265
H  1.592006 2.614391 0.000343
H  0.767905 -1.664522 -0.000338
H  -0.546155 1.851187 0.000196
H  4.061137 2.138743 0.000298
H  3.252944 -2.116482 -0.000383
H  -2.685441 1.701142 0.000154
H  -7.112327 0.864743 -0.000114
H  -6.434683 -1.897465 -0.000373
