program: Gaussian 09
title: 000211753
version: EM64L-G09RevD.01
frameworkgroup: C1[X(C6H16N2S)]
method: RPBEPBE
basis: SDD
operation: Freq
keyword: #p
keyword: freq=noraman
keyword: PBEPBE/SDD
title: #p freq=noraman PBEPBE/SDD
converged: YES YES NO NO
title: Mulliken charges:
elementType: S N N C C C C C C H H H H H H H H H H H H H H H H
charge: -0.051648 -0.293448 -0.285172 -0.372972 -0.368251 -0.289539 -0.319618 -0.689176 -0.689235 0.167263 0.234955 0.229987 0.162726 0.241279 0.230664 0.200306 0.239143 0.176927 0.212289 0.243855 0.273164 0.233013 0.201663 0.212041 0.099784
chargesum: 0.00000
title: Mulliken charges with hydrogens summed into heavy atoms:
elementType: S N N C C C C C C
charge: 0.048137 -0.052169 -0.046029 0.029246 0.024462 0.141431 0.069598 -0.172157 -0.042517
polarizability: 1.39895360e+02 -8.88479452e-01 8.52674636e+01 -1.54535456e+00 -1.63314909e+00 7.14979363e+01
1716.lowfreq: -0.0020 -0.0018 -0.0010 4.3118 7.5392 29.7400 36.0966 53.7615 69.3248
frequency: 32.0219 53.6348 68.7471 82.3446 120.4662 135.3611 141.9844 157.0458 177.4130 210.9336 254.0344 287.9379 367.7104 449.0008 492.6837 671.4647 685.6234 703.9125 795.2374 808.2674 819.6774 825.6132 902.1681 988.9125 1012.3728 1037.5421 1058.7283 1073.6901 1100.4475 1117.4579 1136.7302 1147.3157 1160.9672 1193.9065 1226.6347 1250.6209 1264.0775 1271.1972 1281.1247 1305.1380 1342.7690 1373.1960 1391.1636 1403.4736 1448.5983 1450.2220 1457.4221 1473.2010 1477.8885 1482.3299 1489.0289 1495.2815 1500.1682 2443.8351 2817.5933 2838.1130 2851.3061 2873.4435 2978.9456 2999.5855 3021.5265 3024.9634 3033.9759 3042.3124 3071.2533 3093.5604 3110.8357 3421.9534 3426.0684
redmass: 4.0193 4.4430 2.1040 2.5656 1.9723 3.2229 2.1820 1.1232 3.1101 4.4876 1.1267 3.4971 3.8906 3.5198 3.1655 1.3898 1.3178 3.7870 1.1256 1.0960 1.1797 1.1402 1.7029 1.5193 2.6649 2.1587 2.9522 1.6921 2.0903 1.6654 1.5829 3.3417 3.2690 1.7369 1.4155 1.2055 1.2170 1.1258 1.1170 1.2242 1.3109 1.3606 1.2537 1.4792 1.1865 1.1830 1.1254 1.0583 1.0687 1.0593 1.0889 1.0841 1.0845 1.0385 1.0720 1.0718 1.0722 1.0711 1.0377 1.0862 1.0653 1.0834 1.0815 1.0903 1.0978 1.1002 1.1070 1.0738 1.0738
irintensity: 0.3312 0.4521 1.4798 0.6100 11.3883 1.5226 5.9791 26.2953 2.3257 0.1375 0.9500 3.2576 1.0411 7.2393 5.2306 133.1755 62.9784 16.3255 5.6243 1.6711 6.7788 3.7125 2.4766 12.0866 8.4932 12.0182 1.8896 21.8379 17.0233 3.4229 11.1845 13.8532 112.7589 6.2557 2.1482 6.8989 20.5903 1.6047 2.7396 11.6631 2.1839 1.2475 19.2372 5.1951 42.6242 25.6187 11.7188 18.1782 0.7518 5.7806 4.2787 2.3360 5.0372 37.8050 128.5213 99.5268 155.2823 97.1660 31.6372 29.5080 17.1773 15.8978 29.6293 48.5902 58.3451 38.3959 24.6844 2.4835 1.7596
temp: 298.150 k
press: 1.00000 atm
elementType: 16 7 7 6 6 6 6 6 6 1 1 1 1 1 1 1 1 1 1 1 1 1 1 1 1
symmnumber: 1
zpe: 572438.0 jmol-1
zpe.correction: 0.218030 hartree
zpe.thermalcorrener: 0.230833 hartree
zpe.thermalcorrenthalpy: 0.231777 hartree
zpe.thermalcorrgfe: 0.177458 hartree
zpe.sumelectzpe: -744.986386 hartree
zpe.sumelectthermal: -744.973584 hartree
zpe.sumelectthermalent: -744.972640 hartree
zpe.sumelectthermalfe: -745.026958 hartree
dipole: -1.3338 1.4957 1.4558
dipole: 2.4770
quadrupole: -66.9699 -65.7511 -65.4169
quadrupole: 5.8189 -3.8854 -0.5830
quadrupole: -0.9239 0.2949 0.6290 5.8189 -3.8854 -0.5830
hfenergy: -745.2044166 hartree
pointgroup: C01 [X(C6H16N2S1)]
dipole: 0.5165591 -0.5804218 0.5882158 debye
dipolederiv: -0.3044558 0.1142 0.025753 0.1135948 0.1080373 0.0925241 0.0498517 0.0815627 -0.2613021 -1.0386974 -0.0057348 -0.0109357 -0.0402215 -0.4701368 -0.1953361 0.0328903 -0.2009564 -0.2255819 -0.9149784 0.022623 0.0261448 0.041021 -0.484623 0.2101304 0.0303328 0.2457844 -0.2830985 0.4801203 0.1685517 0.0161665 0.3006567 0.3144499 0.1176093 -0.1346728 0.1284584 0.3043043 0.4266245 0.1498377 -0.0443357 0.2459935 0.2984047 -0.1336644 0.0449026 -0.1429372 0.3500575 0.527078 -0.1886809 -0.0344496 -0.0783927 0.243637 0.1055761 0.1143667 0.075065 0.3017872 0.5490993 -0.1814111 0.0176394 -0.3172608 0.3384787 -0.0880239 -0.0984039 -0.0883322 0.3430483 0.4103399 -0.1964425 -0.0023123 -0.1750419 0.0550442 -0.0537906 0.0039459 -0.0699853 0.1430957 -0.1210096 -0.0523464 0.0182715 -0.0357366 0.0318603 0.0151217 -0.0003162 0.0340408 0.0876786 -0.1143476 -0.0489609 -0.0154651 -0.1532528 -0.149619 -0.1420759 -0.0885974 -0.1922479 -0.1134475 0.0553339 0.0080088 -0.0333828 -0.0306757 -0.0070149 0.0835169 -0.0169068 0.0994307 -0.0884544 0.0601783 0.0035498 0.0225057 -0.0322275 -0.0372364 -0.0910781 0.0105263 -0.1102758 -0.0717428 -0.0908718 -0.0348039 0.0182656 -0.1189712 -0.1168969 0.1522552 0.1032883 0.2023301 -0.1703605 0.1336393 0.0017687 -0.0063656 0.0009925 0.198472 0.0964561 -0.00073 0.1802595 0.0324955 0.0585682 -0.0099345 0.0397882 0.0075458 -0.0106963 0.0904675 0.0234982 0.099748 -0.0648163 -0.0889489 0.0564302 0.0166247 0.1293657 -0.0974291 -0.132477 0.075163 -0.1569924 -0.1035376 0.1284857 -0.0024716 0.0049418 -0.0095147 0.168891 -0.1058839 0.0062513 -0.2107149 0.0471704 -0.0923761 0.013881 0.0098028 0.1356433 -0.1525165 0.1519895 -0.0770122 0.2034603 -0.1284035 0.0190144 -0.0250098 -0.0419879 0.0362225 -0.0324944 -0.1086409 0.0037315 -0.1304346 -0.106446 -0.0425977 0.0724501 -0.025138 0.0335129 -0.052035 0.1120428 -0.0166126 0.1280651 -0.0501088 -0.0185297 0.0670936 0.0220501 0.0364907 -0.0143707 -0.0927459 -0.0176443 -0.0912726 -0.0402119 0.109716 0.014123 -0.0304198 -0.0411911 -0.0231052 0.1191672 0.0135848 0.126169 -0.0503015 0.0826411 0.0020519 0.0199979 -0.0508204 -0.0011672 -0.1149223 -0.0235705 -0.1393128 -0.1139014 -0.1571807 0.0892786 0.0195086 0.1331132 0.016055 -0.0149869 0.0181076 -0.0130063 0.1046031 -0.0568452 -0.0380515 -0.032668 -0.1308455 -0.1239886 -0.0732307 -0.0559743 -0.0579058 0.1574741 unknown
polarizability: 139.8596351|-1.4832895|85.3653277|1.7621201|1.2759443|71.4357966 unknown
InChI: InChI=1S/C6H16N2S/c1-2-7-3-4-8-5-6-9/h7-9H,2-6H2,1H3
charge 0 multiplicity 1
25 atoms
S  -5.266291 0.422467 -0.040652
N  -1.212401 -0.385702 0.196386
N  2.501476 0.291952 0.041423
C  0.025765 0.411009 0.063581
C  1.261617 -0.507125 0.086892
C  -2.4711 0.381804 0.096367
C  3.749995 -0.497169 -0.040576
C  -3.654096 -0.592208 -0.023103
C  4.980983 0.424988 -0.060082
H  0.131377 1.189827 0.864254
H  -0.000011 0.949572 -0.901232
H  1.231924 -1.167033 -0.799941
H  1.205437 -1.178946 0.985905
H  -1.192368 -0.971854 1.043355
H  -2.421698 1.007717 -0.814177
H  -2.639997 1.07517 0.957857
H  2.540307 0.973654 0.813374
H  3.849208 -1.233659 0.798063
H  3.715481 -1.090123 -0.97587
H  -3.686985 -1.282052 0.83819
H  -3.573628 -1.170201 -0.956478
H  4.919066 1.128254 -0.908817
H  5.050319 1.017878 0.872534
H  5.911657 -0.163025 -0.153736
H  -6.103839 -0.633594 -0.359818
