program: Gaussian 09
title: 000211749
version: EM64L-G09RevD.01
frameworkgroup: C1[X(C15H16N2O2)]
method: RPBEPBE
basis: SDD
operation: Freq
keyword: #p
keyword: freq=noraman
keyword: PBEPBE/SDD
title: #p freq=noraman PBEPBE/SDD
converged: YES YES NO NO
title: Mulliken charges:
elementType: O O N N C C C C C C C C C C C C C C C H H H H H H H H H H H H H H H H
charge: -0.356877 -0.268611 -0.121958 -0.662671 0.188452 0.165870 -0.517827 0.304218 0.354899 0.100298 -0.341209 -0.365337 -0.362565 -0.382544 -0.227073 -0.240749 -0.232746 -0.520338 -0.537208 0.272071 0.243336 0.241516 0.276951 0.224661 0.228517 0.225993 0.229411 0.390341 0.307526 0.229063 0.227293 0.247637 0.218561 0.217907 0.243191
chargesum: 0.00000
title: Mulliken charges with hydrogens summed into heavy atoms:
elementType: O O N N C C C C C C C C C C C C C C C
charge: -0.356877 -0.268611 -0.121958 0.035196 0.188452 0.165870 -0.245756 0.304218 0.354899 0.100298 -0.097873 -0.123820 -0.085614 -0.157884 0.001444 -0.014755 -0.003335 0.183656 0.142451
polarizability: 3.22808153e+02 5.45489013e+00 1.89319995e+02 -6.78054373e-01 -1.40070346e+01 9.76064495e+01
1716.lowfreq: -6.4125 0.0001 0.0006 0.0007 2.3836 6.5297 37.6668 42.1376 60.0331
frequency: 37.5986 42.1204 60.0062 78.4642 94.6501 106.3714 113.5986 138.7715 171.3762 187.4061 212.1651 230.8349 255.6687 261.1168 286.5105 313.8846 374.9296 401.7915 409.9665 424.7060 440.7854 478.1943 481.9469 516.2139 552.4574 569.3353 615.2309 619.0217 654.3558 667.8971 686.0861 701.7572 715.4924 736.5123 747.9484 773.5009 787.1862 795.1892 857.8629 880.7898 890.8995 923.8086 935.7010 946.9211 983.5050 989.9288 1002.1107 1003.7321 1022.9283 1044.1925 1079.9260 1107.4539 1111.2835 1116.3001 1141.2307 1149.0956 1152.4052 1169.8918 1171.6894 1184.7417 1189.1334 1237.5865 1267.0188 1311.6989 1360.0382 1369.0296 1385.1690 1406.4678 1428.3861 1435.6143 1436.2706 1456.7566 1465.9703 1470.1031 1473.2900 1476.0648 1485.3094 1554.8561 1574.4065 1589.2257 1611.3360 1620.6073 1636.8401 2954.4507 2971.5081 3040.2781 3067.6088 3117.4473 3119.6379 3121.1572 3130.2339 3143.1932 3145.4674 3158.9132 3171.5033 3171.9504 3176.9592 3366.4403 3628.3958
redmass: 3.9097 4.4723 3.8826 3.7567 3.0667 3.9911 4.3054 1.1358 3.4683 4.6497 1.8819 3.5754 4.4330 1.9106 4.8824 5.1380 6.1111 4.1192 3.2302 3.6306 3.7019 1.7783 2.6299 2.6971 4.4056 4.7511 5.5466 4.0735 5.2777 4.0155 4.7594 1.7509 5.4258 3.0988 1.2944 2.9527 2.4087 1.6345 1.2468 1.6865 4.2078 1.4007 1.4389 6.8746 1.4591 4.8029 4.0220 1.3612 2.4172 2.3130 1.6150 1.7123 1.2650 1.2514 1.9449 1.5263 1.4161 1.7282 1.1610 1.2106 2.0200 1.6609 3.3717 1.3468 6.6083 3.9397 8.8080 3.3357 1.3085 2.1299 1.2174 1.0561 1.0506 1.9783 1.0580 1.2382 2.5891 6.1506 3.3223 3.9089 5.4434 3.2786 2.5020 1.0332 1.0300 1.1037 1.1051 1.1025 1.0856 1.0989 1.0876 1.0931 1.0882 1.0970 1.0982 1.0951 1.0921 1.0574 1.0925
irintensity: 0.5483 1.1658 7.4532 1.0475 4.5820 1.0694 0.8246 0.3100 6.3645 6.2333 1.2631 9.2059 0.0755 4.1533 1.4651 10.1428 1.6469 15.7678 3.4322 14.0146 13.5383 43.7252 35.0303 59.0107 3.5263 4.9123 2.1144 7.4869 8.0652 5.6141 22.6031 45.3346 7.6643 3.6337 111.7072 31.5664 20.5170 52.3388 2.0255 36.1249 9.4454 1.6653 5.3327 48.3724 2.4467 0.0973 94.0875 1.8466 7.7345 40.2777 15.6365 18.7290 0.3849 0.6367 5.5901 0.4129 37.1528 142.7770 25.7489 1.6680 28.3696 9.2058 59.5188 3.1394 25.9358 111.2158 0.5231 9.7224 7.7041 16.8240 11.7603 9.0710 12.8635 160.0322 11.2124 0.8565 29.0117 66.4469 385.9553 33.8779 2.0649 116.7291 320.2481 84.4732 54.8364 53.0255 31.8997 24.0693 6.5984 27.7101 1.9428 30.1551 6.2679 29.1449 19.6379 10.2050 1.5231 145.4388 51.9895
temp: 298.150 k
press: 1.00000 atm
elementType: 8 8 7 7 6 6 6 6 6 6 6 6 6 6 6 6 6 6 6 1 1 1 1 1 1 1 1 1 1 1 1 1 1 1 1
symmnumber: 1
zpe: 731718.4 jmol-1
zpe.correction: 0.278697 hartree
zpe.thermalcorrener: 0.296511 hartree
zpe.thermalcorrenthalpy: 0.297456 hartree
zpe.thermalcorrgfe: 0.232448 hartree
zpe.sumelectzpe: -839.746625 hartree
zpe.sumelectthermal: -839.728810 hartree
zpe.sumelectthermalent: -839.727866 hartree
zpe.sumelectthermalfe: -839.792873 hartree
dipole: -0.0134 2.2167 -0.1995
dipole: 2.2257
quadrupole: -80.7582 -103.0819 -113.4967
quadrupole: 3.0741 -1.7855 -0.1563
quadrupole: 18.3540 -3.9696 -14.3844 3.0741 -1.7855 -0.1563
hfenergy: -840.0253214 hartree
pointgroup: C01 [X(C15H16N2O2)]
dipole: 0.0331457 0.5996418 0.6372563 debye
polarizability: 322.2978385|-4.7774915|135.0790784|-8.7021511|47.4066863|152.3576812 unknown
InChI: InChI=1S/C15H16N2O2/c1-18-12-8-9-14(19-2)13(10-12)17-15(16)11-6-4-3-5-7-11/h3-10H,16H2,1-2H3
charge 0 multiplicity 1
35 atoms
O  1.053402 1.884361 1.697006
O  4.081932 -1.65098 -1.504357
N  -0.234014 -0.021367 -0.292293
N  -1.09504 0.225091 1.954251
C  1.149754 0.090485 -0.040246
C  1.80515 0.987969 0.871232
C  1.98948 -0.747641 -0.824294
C  -2.606878 -0.254703 0.076343
C  3.392324 -0.745406 -0.676205
C  -1.220486 0.009334 0.590476
C  3.203744 0.995557 1.008656
C  4.018985 0.126123 0.25205
C  -2.771554 -0.958144 -1.145593
C  -3.762517 0.182704 0.777823
C  -4.060002 -1.232493 -1.646494
C  -5.053955 -0.092715 0.275398
C  -5.207813 -0.80556 -0.935407
C  0.513933 3.055695 0.970211
C  5.540138 -1.68362 -1.393534
H  1.524737 -1.421269 -1.548809
H  3.646529 1.69166 1.728972
H  5.104041 0.145136 0.383836
H  -1.868357 -1.268595 -1.679154
H  -3.662034 0.774596 1.695612
H  -4.172761 -1.780841 -2.588405
H  -5.936966 0.257202 0.82183
H  -6.209555 -1.020755 -1.323975
H  -0.255628 0.711017 2.30015
H  -1.864078 0.00765 2.583887
H  1.346452 3.658875 0.563123
H  -0.049057 3.641143 1.713482
H  -0.15358 2.737455 0.14796
H  5.862557 -1.971729 -0.373448
H  5.98897 -0.706278 -1.65998
H  5.866648 -2.448562 -2.113603
